bigtop-ci mailing list archives

Site index · List index
Message view « Date » · « Thread »
Top « Date » · « Thread »
From Apache Jenkins Server <jenk...@builds.apache.org>
Subject Build failed in Jenkins: Bigtop-trunk-testartifacts #2210
Date Fri, 20 May 2016 22:21:03 GMT
See <https://builds.apache.org/job/Bigtop-trunk-testartifacts/2210/changes>

Changes:

[cos] BIGTOP-2400. Get groovy plugins used by Maven in sync with Bigtop groovy

------------------------------------------
[...truncated 275 lines...]
[INFO] 
[INFO] --- maven-deploy-plugin:2.5:deploy (default-deploy) @ bigtop-smokes ---
Downloading: https://repository.apache.org/content/repositories/snapshots/org/apache/bigtop/itest/bigtop-smokes/1.2.0-SNAPSHOT/maven-metadata.xml
Downloaded: https://repository.apache.org/content/repositories/snapshots/org/apache/bigtop/itest/bigtop-smokes/1.2.0-SNAPSHOT/maven-metadata.xml
(615 B at 0.7 KB/sec)
Uploading: https://repository.apache.org/content/repositories/snapshots/org/apache/bigtop/itest/bigtop-smokes/1.2.0-SNAPSHOT/bigtop-smokes-1.2.0-20160520.221959-80.pom
Uploaded: https://repository.apache.org/content/repositories/snapshots/org/apache/bigtop/itest/bigtop-smokes/1.2.0-SNAPSHOT/bigtop-smokes-1.2.0-20160520.221959-80.pom
(5 KB at 5.8 KB/sec)
Downloading: https://repository.apache.org/content/repositories/snapshots/org/apache/bigtop/itest/bigtop-smokes/maven-metadata.xml
Downloaded: https://repository.apache.org/content/repositories/snapshots/org/apache/bigtop/itest/bigtop-smokes/maven-metadata.xml
(507 B at 0.9 KB/sec)
Uploading: https://repository.apache.org/content/repositories/snapshots/org/apache/bigtop/itest/bigtop-smokes/1.2.0-SNAPSHOT/maven-metadata.xml
Uploaded: https://repository.apache.org/content/repositories/snapshots/org/apache/bigtop/itest/bigtop-smokes/1.2.0-SNAPSHOT/maven-metadata.xml
(615 B at 0.8 KB/sec)
Uploading: https://repository.apache.org/content/repositories/snapshots/org/apache/bigtop/itest/bigtop-smokes/maven-metadata.xml
Uploaded: https://repository.apache.org/content/repositories/snapshots/org/apache/bigtop/itest/bigtop-smokes/maven-metadata.xml
(507 B at 0.7 KB/sec)
[INFO]                                                                         
[INFO] ------------------------------------------------------------------------
[INFO] Building hadoopsmoke 1.2.0-SNAPSHOT
[INFO] ------------------------------------------------------------------------
Downloading: http://repo.maven.apache.org/maven2/org/apache/maven/plugins/maven-resources-plugin/2.4.3/maven-resources-plugin-2.4.3.pom
Downloaded: http://repo.maven.apache.org/maven2/org/apache/maven/plugins/maven-resources-plugin/2.4.3/maven-resources-plugin-2.4.3.pom
(6 KB at 276.7 KB/sec)
Downloading: http://repo.maven.apache.org/maven2/org/apache/maven/plugins/maven-resources-plugin/2.4.3/maven-resources-plugin-2.4.3.jar
Downloaded: http://repo.maven.apache.org/maven2/org/apache/maven/plugins/maven-resources-plugin/2.4.3/maven-resources-plugin-2.4.3.jar
(24 KB at 1192.7 KB/sec)
Downloading: http://repo.maven.apache.org/maven2/org/apache/maven/plugins/maven-surefire-plugin/2.7/maven-surefire-plugin-2.7.pom
Downloaded: http://repo.maven.apache.org/maven2/org/apache/maven/plugins/maven-surefire-plugin/2.7/maven-surefire-plugin-2.7.pom
(10 KB at 436.6 KB/sec)
Downloading: http://repo.maven.apache.org/maven2/org/apache/maven/surefire/surefire/2.7/surefire-2.7.pom
Downloaded: http://repo.maven.apache.org/maven2/org/apache/maven/surefire/surefire/2.7/surefire-2.7.pom
(9 KB at 424.4 KB/sec)
Downloading: http://repo.maven.apache.org/maven2/org/apache/maven/plugins/maven-surefire-plugin/2.7/maven-surefire-plugin-2.7.jar
Downloaded: http://repo.maven.apache.org/maven2/org/apache/maven/plugins/maven-surefire-plugin/2.7/maven-surefire-plugin-2.7.jar
(29 KB at 1338.6 KB/sec)
Downloading: http://repo.maven.apache.org/maven2/org/apache/maven/plugins/maven-jar-plugin/2.2/maven-jar-plugin-2.2.pom
Downloaded: http://repo.maven.apache.org/maven2/org/apache/maven/plugins/maven-jar-plugin/2.2/maven-jar-plugin-2.2.pom
(9 KB at 398.1 KB/sec)
Downloading: http://repo.maven.apache.org/maven2/org/apache/maven/plugins/maven-plugins/10/maven-plugins-10.pom
Downloaded: http://repo.maven.apache.org/maven2/org/apache/maven/plugins/maven-plugins/10/maven-plugins-10.pom
(8 KB at 346.5 KB/sec)
Downloading: http://repo.maven.apache.org/maven2/org/apache/maven/plugins/maven-jar-plugin/2.2/maven-jar-plugin-2.2.jar
Downloaded: http://repo.maven.apache.org/maven2/org/apache/maven/plugins/maven-jar-plugin/2.2/maven-jar-plugin-2.2.jar
(27 KB at 1182.8 KB/sec)
Downloading: http://repo.maven.apache.org/maven2/org/apache/hadoop/hadoop-common/2.7.2/hadoop-common-2.7.2.pom
Downloaded: http://repo.maven.apache.org/maven2/org/apache/hadoop/hadoop-common/2.7.2/hadoop-common-2.7.2.pom
(30 KB at 1292.2 KB/sec)
Downloading: http://repo.maven.apache.org/maven2/org/apache/hadoop/hadoop-project-dist/2.7.2/hadoop-project-dist-2.7.2.pom
Downloaded: http://repo.maven.apache.org/maven2/org/apache/hadoop/hadoop-project-dist/2.7.2/hadoop-project-dist-2.7.2.pom
(19 KB at 885.6 KB/sec)
Downloading: http://repo.maven.apache.org/maven2/org/apache/hadoop/hadoop-project/2.7.2/hadoop-project-2.7.2.pom
Downloaded: http://repo.maven.apache.org/maven2/org/apache/hadoop/hadoop-project/2.7.2/hadoop-project-2.7.2.pom
(45 KB at 2103.8 KB/sec)
Downloading: http://repo.maven.apache.org/maven2/org/apache/hadoop/hadoop-main/2.7.2/hadoop-main-2.7.2.pom
Downloaded: http://repo.maven.apache.org/maven2/org/apache/hadoop/hadoop-main/2.7.2/hadoop-main-2.7.2.pom
(19 KB at 922.5 KB/sec)
Downloading: http://repo.maven.apache.org/maven2/org/apache/hadoop/hadoop-annotations/2.7.2/hadoop-annotations-2.7.2.pom
Downloaded: http://repo.maven.apache.org/maven2/org/apache/hadoop/hadoop-annotations/2.7.2/hadoop-annotations-2.7.2.pom
(3 KB at 114.7 KB/sec)
Downloading: http://repo.maven.apache.org/maven2/org/mortbay/jetty/jetty/6.1.26/jetty-6.1.26.pom
Downloaded: http://repo.maven.apache.org/maven2/org/mortbay/jetty/jetty/6.1.26/jetty-6.1.26.pom
(7 KB at 305.6 KB/sec)
Downloading: http://repo.maven.apache.org/maven2/org/mortbay/jetty/project/6.1.26/project-6.1.26.pom
Downloaded: http://repo.maven.apache.org/maven2/org/mortbay/jetty/project/6.1.26/project-6.1.26.pom
(9 KB at 449.5 KB/sec)
Downloading: http://repo.maven.apache.org/maven2/org/mortbay/jetty/jetty-util/6.1.26/jetty-util-6.1.26.pom
Downloaded: http://repo.maven.apache.org/maven2/org/mortbay/jetty/jetty-util/6.1.26/jetty-util-6.1.26.pom
(4 KB at 189.3 KB/sec)
Downloading: http://repo.maven.apache.org/maven2/javax/servlet/jsp/jsp-api/2.1/jsp-api-2.1.pom
Downloaded: http://repo.maven.apache.org/maven2/javax/servlet/jsp/jsp-api/2.1/jsp-api-2.1.pom
(157 B at 7.3 KB/sec)
Downloading: http://repo.maven.apache.org/maven2/com/sun/jersey/jersey-core/1.9/jersey-core-1.9.pom
Downloaded: http://repo.maven.apache.org/maven2/com/sun/jersey/jersey-core/1.9/jersey-core-1.9.pom
(11 KB at 461.2 KB/sec)
Downloading: http://repo.maven.apache.org/maven2/com/sun/jersey/jersey-project/1.9/jersey-project-1.9.pom
Downloaded: http://repo.maven.apache.org/maven2/com/sun/jersey/jersey-project/1.9/jersey-project-1.9.pom
(18 KB at 822.0 KB/sec)
Downloading: http://repo.maven.apache.org/maven2/com/sun/jersey/jersey-json/1.9/jersey-json-1.9.pom
Downloaded: http://repo.maven.apache.org/maven2/com/sun/jersey/jersey-json/1.9/jersey-json-1.9.pom
(11 KB at 503.9 KB/sec)
Downloading: http://repo.maven.apache.org/maven2/org/codehaus/jettison/jettison/1.1/jettison-1.1.pom
Downloaded: http://repo.maven.apache.org/maven2/org/codehaus/jettison/jettison/1.1/jettison-1.1.pom
(4 KB at 156.9 KB/sec)
Downloading: http://repo.maven.apache.org/maven2/com/sun/xml/bind/jaxb-impl/2.2.3-1/jaxb-impl-2.2.3-1.pom
Downloaded: http://repo.maven.apache.org/maven2/com/sun/xml/bind/jaxb-impl/2.2.3-1/jaxb-impl-2.2.3-1.pom
(6 KB at 214.2 KB/sec)
Downloading: http://repo.maven.apache.org/maven2/org/codehaus/jackson/jackson-core-asl/1.8.3/jackson-core-asl-1.8.3.pom
Downloaded: http://repo.maven.apache.org/maven2/org/codehaus/jackson/jackson-core-asl/1.8.3/jackson-core-asl-1.8.3.pom
(1016 B at 47.2 KB/sec)
Downloading: http://repo.maven.apache.org/maven2/org/codehaus/jackson/jackson-mapper-asl/1.8.3/jackson-mapper-asl-1.8.3.pom
Downloaded: http://repo.maven.apache.org/maven2/org/codehaus/jackson/jackson-mapper-asl/1.8.3/jackson-mapper-asl-1.8.3.pom
(2 KB at 63.8 KB/sec)
Downloading: http://repo.maven.apache.org/maven2/org/codehaus/jackson/jackson-jaxrs/1.8.3/jackson-jaxrs-1.8.3.pom
Downloaded: http://repo.maven.apache.org/maven2/org/codehaus/jackson/jackson-jaxrs/1.8.3/jackson-jaxrs-1.8.3.pom
(2 KB at 84.1 KB/sec)
Downloading: http://repo.maven.apache.org/maven2/org/codehaus/jackson/jackson-xc/1.8.3/jackson-xc-1.8.3.pom
Downloaded: http://repo.maven.apache.org/maven2/org/codehaus/jackson/jackson-xc/1.8.3/jackson-xc-1.8.3.pom
(2 KB at 84.3 KB/sec)
Downloading: http://repo.maven.apache.org/maven2/com/sun/jersey/jersey-server/1.9/jersey-server-1.9.pom
Downloaded: http://repo.maven.apache.org/maven2/com/sun/jersey/jersey-server/1.9/jersey-server-1.9.pom
(12 KB at 594.2 KB/sec)
Downloading: http://repo.maven.apache.org/maven2/asm/asm/3.1/asm-3.1.pom
Downloaded: http://repo.maven.apache.org/maven2/asm/asm/3.1/asm-3.1.pom (278 B at 12.9 KB/sec)
Downloading: http://repo.maven.apache.org/maven2/asm/asm-parent/3.1/asm-parent-3.1.pom
Downloaded: http://repo.maven.apache.org/maven2/asm/asm-parent/3.1/asm-parent-3.1.pom (5 KB
at 213.5 KB/sec)
Downloading: http://repo.maven.apache.org/maven2/org/apache/httpcomponents/httpclient/4.1.2/httpclient-4.1.2.pom
Downloaded: http://repo.maven.apache.org/maven2/org/apache/httpcomponents/httpclient/4.1.2/httpclient-4.1.2.pom
(6 KB at 292.5 KB/sec)
Downloading: http://repo.maven.apache.org/maven2/org/apache/httpcomponents/httpcomponents-client/4.1.2/httpcomponents-client-4.1.2.pom
Downloaded: http://repo.maven.apache.org/maven2/org/apache/httpcomponents/httpcomponents-client/4.1.2/httpcomponents-client-4.1.2.pom
(12 KB at 556.1 KB/sec)
Downloading: http://repo.maven.apache.org/maven2/org/slf4j/slf4j-log4j12/1.7.10/slf4j-log4j12-1.7.10.pom
Downloaded: http://repo.maven.apache.org/maven2/org/slf4j/slf4j-log4j12/1.7.10/slf4j-log4j12-1.7.10.pom
(2 KB at 80.8 KB/sec)
Downloading: http://repo.maven.apache.org/maven2/org/apache/hadoop/hadoop-auth/2.7.2/hadoop-auth-2.7.2.pom
Downloaded: http://repo.maven.apache.org/maven2/org/apache/hadoop/hadoop-auth/2.7.2/hadoop-auth-2.7.2.pom
(8 KB at 373.9 KB/sec)
Downloading: http://repo.maven.apache.org/maven2/org/apache/httpcomponents/httpclient/4.2.5/httpclient-4.2.5.pom
Downloaded: http://repo.maven.apache.org/maven2/org/apache/httpcomponents/httpclient/4.2.5/httpclient-4.2.5.pom
(0 B at 0.0 KB/sec)
Downloading: http://repo.maven.apache.org/maven2/org/apache/httpcomponents/httpcomponents-client/4.2.5/httpcomponents-client-4.2.5.pom
Downloaded: http://repo.maven.apache.org/maven2/org/apache/httpcomponents/httpcomponents-client/4.2.5/httpcomponents-client-4.2.5.pom
(0 B at 0.0 KB/sec)
Downloading: http://repo.maven.apache.org/maven2/org/apache/httpcomponents/httpcore/4.2.4/httpcore-4.2.4.pom
Downloaded: http://repo.maven.apache.org/maven2/org/apache/httpcomponents/httpcore/4.2.4/httpcore-4.2.4.pom
(0 B at 0.0 KB/sec)
Downloading: http://repo.maven.apache.org/maven2/org/apache/httpcomponents/httpcomponents-core/4.2.4/httpcomponents-core-4.2.4.pom
Downloaded: http://repo.maven.apache.org/maven2/org/apache/httpcomponents/httpcomponents-core/4.2.4/httpcomponents-core-4.2.4.pom
(0 B at 0.0 KB/sec)
Downloading: http://repo.maven.apache.org/maven2/org/apache/zookeeper/zookeeper/3.4.5/zookeeper-3.4.5.pom
Downloaded: http://repo.maven.apache.org/maven2/org/apache/zookeeper/zookeeper/3.4.5/zookeeper-3.4.5.pom
(3 KB at 146.5 KB/sec)
Downloading: http://repo.maven.apache.org/maven2/jline/jline/0.9.94/jline-0.9.94.pom
Downloaded: http://repo.maven.apache.org/maven2/jline/jline/0.9.94/jline-0.9.94.pom (7 KB
at 295.7 KB/sec)
Downloading: http://repo.maven.apache.org/maven2/org/apache/curator/curator-framework/2.7.1/curator-framework-2.7.1.pom
Downloaded: http://repo.maven.apache.org/maven2/org/apache/curator/curator-framework/2.7.1/curator-framework-2.7.1.pom
(3 KB at 105.7 KB/sec)
Downloading: http://repo.maven.apache.org/maven2/org/apache/curator/apache-curator/2.7.1/apache-curator-2.7.1.pom
Downloaded: http://repo.maven.apache.org/maven2/org/apache/curator/apache-curator/2.7.1/apache-curator-2.7.1.pom
(32 KB at 1480.1 KB/sec)
Downloading: http://repo.maven.apache.org/maven2/org/apache/curator/curator-client/2.7.1/curator-client-2.7.1.pom
Downloaded: http://repo.maven.apache.org/maven2/org/apache/curator/curator-client/2.7.1/curator-client-2.7.1.pom
(3 KB at 110.4 KB/sec)
Downloading: http://repo.maven.apache.org/maven2/org/slf4j/slf4j-api/1.7.6/slf4j-api-1.7.6.pom
Downloaded: http://repo.maven.apache.org/maven2/org/slf4j/slf4j-api/1.7.6/slf4j-api-1.7.6.pom
(3 KB at 131.3 KB/sec)
Downloading: http://repo.maven.apache.org/maven2/org/slf4j/slf4j-parent/1.7.6/slf4j-parent-1.7.6.pom
Downloaded: http://repo.maven.apache.org/maven2/org/slf4j/slf4j-parent/1.7.6/slf4j-parent-1.7.6.pom
(12 KB at 553.7 KB/sec)
Downloading: http://repo.maven.apache.org/maven2/org/jboss/netty/netty/3.2.2.Final/netty-3.2.2.Final.pom
Downloaded: http://repo.maven.apache.org/maven2/org/jboss/netty/netty/3.2.2.Final/netty-3.2.2.Final.pom
(24 KB at 1164.4 KB/sec)
Downloading: http://repo.maven.apache.org/maven2/com/google/guava/guava/16.0.1/guava-16.0.1.pom
Downloaded: http://repo.maven.apache.org/maven2/com/google/guava/guava/16.0.1/guava-16.0.1.pom
(6 KB at 313.6 KB/sec)
Downloading: http://repo.maven.apache.org/maven2/com/google/guava/guava-parent/16.0.1/guava-parent-16.0.1.pom
Downloaded: http://repo.maven.apache.org/maven2/com/google/guava/guava-parent/16.0.1/guava-parent-16.0.1.pom
(8 KB at 377.1 KB/sec)
Downloading: http://repo.maven.apache.org/maven2/org/apache/curator/curator-recipes/2.7.1/curator-recipes-2.7.1.pom
Downloaded: http://repo.maven.apache.org/maven2/org/apache/curator/curator-recipes/2.7.1/curator-recipes-2.7.1.pom
(3 KB at 115.5 KB/sec)
Downloading: http://repo.maven.apache.org/maven2/org/apache/hadoop/hadoop-hdfs/2.7.2/hadoop-hdfs-2.7.2.pom
Downloaded: http://repo.maven.apache.org/maven2/org/apache/hadoop/hadoop-hdfs/2.7.2/hadoop-hdfs-2.7.2.pom
(24 KB at 1164.2 KB/sec)
Downloading: http://repo.maven.apache.org/maven2/commons-daemon/commons-daemon/1.0.13/commons-daemon-1.0.13.pom
Downloaded: http://repo.maven.apache.org/maven2/commons-daemon/commons-daemon/1.0.13/commons-daemon-1.0.13.pom
(5 KB at 202.2 KB/sec)
Downloading: http://repo.maven.apache.org/maven2/io/netty/netty/3.6.2.Final/netty-3.6.2.Final.pom
Downloaded: http://repo.maven.apache.org/maven2/io/netty/netty/3.6.2.Final/netty-3.6.2.Final.pom
(26 KB at 1163.2 KB/sec)
Downloading: http://repo.maven.apache.org/maven2/org/fusesource/leveldbjni/leveldbjni-all/1.8/leveldbjni-all-1.8.pom
Downloaded: http://repo.maven.apache.org/maven2/org/fusesource/leveldbjni/leveldbjni-all/1.8/leveldbjni-all-1.8.pom
(8 KB at 306.8 KB/sec)
Downloading: http://repo.maven.apache.org/maven2/org/fusesource/leveldbjni/leveldbjni-project/1.8/leveldbjni-project-1.8.pom
Downloaded: http://repo.maven.apache.org/maven2/org/fusesource/leveldbjni/leveldbjni-project/1.8/leveldbjni-project-1.8.pom
(10 KB at 468.9 KB/sec)
Downloading: http://repo.maven.apache.org/maven2/org/fusesource/fusesource-pom/1.9/fusesource-pom-1.9.pom
Downloaded: http://repo.maven.apache.org/maven2/org/fusesource/fusesource-pom/1.9/fusesource-pom-1.9.pom
(15 KB at 760.2 KB/sec)
Downloading: http://repo.maven.apache.org/maven2/org/apache/hadoop/hadoop-common/2.7.2/hadoop-common-2.7.2.jar
Downloading: http://repo.maven.apache.org/maven2/org/apache/hadoop/hadoop-annotations/2.7.2/hadoop-annotations-2.7.2.jar
Downloading: http://repo.maven.apache.org/maven2/org/mortbay/jetty/jetty/6.1.26/jetty-6.1.26.jar
Downloading: http://repo.maven.apache.org/maven2/org/mortbay/jetty/jetty-util/6.1.26/jetty-util-6.1.26.jar
Downloading: http://repo.maven.apache.org/maven2/javax/servlet/jsp/jsp-api/2.1/jsp-api-2.1.jar
Downloaded: http://repo.maven.apache.org/maven2/org/apache/hadoop/hadoop-annotations/2.7.2/hadoop-annotations-2.7.2.jar
(17 KB at 808.5 KB/sec)
Downloading: http://repo.maven.apache.org/maven2/com/sun/jersey/jersey-core/1.9/jersey-core-1.9.jar
Downloaded: http://repo.maven.apache.org/maven2/org/mortbay/jetty/jetty-util/6.1.26/jetty-util-6.1.26.jar
(173 KB at 4942.3 KB/sec)
Downloading: http://repo.maven.apache.org/maven2/com/sun/jersey/jersey-json/1.9/jersey-json-1.9.jar
Downloaded: http://repo.maven.apache.org/maven2/javax/servlet/jsp/jsp-api/2.1/jsp-api-2.1.jar
(99 KB at 2729.9 KB/sec)
Downloading: http://repo.maven.apache.org/maven2/org/codehaus/jettison/jettison/1.1/jettison-1.1.jar
Downloaded: http://repo.maven.apache.org/maven2/org/mortbay/jetty/jetty/6.1.26/jetty-6.1.26.jar
(528 KB at 9948.3 KB/sec)
Downloading: http://repo.maven.apache.org/maven2/com/sun/xml/bind/jaxb-impl/2.2.3-1/jaxb-impl-2.2.3-1.jar
Downloaded: http://repo.maven.apache.org/maven2/com/sun/jersey/jersey-core/1.9/jersey-core-1.9.jar
(448 KB at 12444.1 KB/sec)
Downloading: http://repo.maven.apache.org/maven2/org/codehaus/jackson/jackson-jaxrs/1.8.3/jackson-jaxrs-1.8.3.jar
Downloaded: http://repo.maven.apache.org/maven2/org/codehaus/jettison/jettison/1.1/jettison-1.1.jar
(67 KB at 3482.6 KB/sec)
Downloading: http://repo.maven.apache.org/maven2/org/codehaus/jackson/jackson-xc/1.8.3/jackson-xc-1.8.3.jar
Downloaded: http://repo.maven.apache.org/maven2/com/sun/jersey/jersey-json/1.9/jersey-json-1.9.jar
(145 KB at 6567.5 KB/sec)
Downloading: http://repo.maven.apache.org/maven2/com/sun/jersey/jersey-server/1.9/jersey-server-1.9.jar
Downloaded: http://repo.maven.apache.org/maven2/org/codehaus/jackson/jackson-jaxrs/1.8.3/jackson-jaxrs-1.8.3.jar
(18 KB at 919.2 KB/sec)
Downloading: http://repo.maven.apache.org/maven2/asm/asm/3.1/asm-3.1.jar
Downloaded: http://repo.maven.apache.org/maven2/org/codehaus/jackson/jackson-xc/1.8.3/jackson-xc-1.8.3.jar
(32 KB at 1661.1 KB/sec)
Downloading: http://repo.maven.apache.org/maven2/net/java/dev/jets3t/jets3t/0.9.0/jets3t-0.9.0.jar
Downloaded: http://repo.maven.apache.org/maven2/com/sun/xml/bind/jaxb-impl/2.2.3-1/jaxb-impl-2.2.3-1.jar
(870 KB at 22289.9 KB/sec)
Downloading: http://repo.maven.apache.org/maven2/org/apache/httpcomponents/httpclient/4.1.2/httpclient-4.1.2.jar
Downloaded: http://repo.maven.apache.org/maven2/asm/asm/3.1/asm-3.1.jar (43 KB at 2101.2 KB/sec)
Downloading: http://repo.maven.apache.org/maven2/org/apache/httpcomponents/httpcore/4.1.2/httpcore-4.1.2.jar
Downloaded: http://repo.maven.apache.org/maven2/com/sun/jersey/jersey-server/1.9/jersey-server-1.9.jar
(697 KB at 21102.3 KB/sec)
Downloading: http://repo.maven.apache.org/maven2/com/jamesmurty/utils/java-xmlbuilder/0.4/java-xmlbuilder-0.4.jar
Downloaded: http://repo.maven.apache.org/maven2/org/apache/httpcomponents/httpcore/4.1.2/httpcore-4.1.2.jar
(177 KB at 8043.3 KB/sec)
Downloading: http://repo.maven.apache.org/maven2/org/slf4j/slf4j-api/1.7.10/slf4j-api-1.7.10.jar
Downloaded: http://repo.maven.apache.org/maven2/org/apache/httpcomponents/httpclient/4.1.2/httpclient-4.1.2.jar
(344 KB at 12740.7 KB/sec)
Downloading: http://repo.maven.apache.org/maven2/org/slf4j/slf4j-log4j12/1.7.10/slf4j-log4j12-1.7.10.jar
Downloaded: http://repo.maven.apache.org/maven2/net/java/dev/jets3t/jets3t/0.9.0/jets3t-0.9.0.jar
(528 KB at 16471.4 KB/sec)
Downloading: http://repo.maven.apache.org/maven2/com/google/code/gson/gson/2.2.4/gson-2.2.4.jar
Downloaded: http://repo.maven.apache.org/maven2/com/jamesmurty/utils/java-xmlbuilder/0.4/java-xmlbuilder-0.4.jar
(19 KB at 1003.1 KB/sec)
Downloading: http://repo.maven.apache.org/maven2/org/apache/hadoop/hadoop-auth/2.7.2/hadoop-auth-2.7.2.jar
Downloaded: http://repo.maven.apache.org/maven2/org/slf4j/slf4j-api/1.7.10/slf4j-api-1.7.10.jar
(32 KB at 1568.3 KB/sec)
Downloading: http://repo.maven.apache.org/maven2/org/apache/curator/curator-framework/2.7.1/curator-framework-2.7.1.jar
Downloaded: http://repo.maven.apache.org/maven2/org/slf4j/slf4j-log4j12/1.7.10/slf4j-log4j12-1.7.10.jar
(9 KB at 481.0 KB/sec)
Downloading: http://repo.maven.apache.org/maven2/org/apache/curator/curator-client/2.7.1/curator-client-2.7.1.jar
Downloaded: http://repo.maven.apache.org/maven2/org/apache/hadoop/hadoop-auth/2.7.2/hadoop-auth-2.7.2.jar
(70 KB at 3451.4 KB/sec)
Downloading: http://repo.maven.apache.org/maven2/org/apache/curator/curator-recipes/2.7.1/curator-recipes-2.7.1.jar
Downloaded: http://repo.maven.apache.org/maven2/com/google/code/gson/gson/2.2.4/gson-2.2.4.jar
(186 KB at 7748.7 KB/sec)
Downloading: http://repo.maven.apache.org/maven2/com/google/code/findbugs/jsr305/3.0.0/jsr305-3.0.0.jar
Downloaded: http://repo.maven.apache.org/maven2/org/apache/curator/curator-client/2.7.1/curator-client-2.7.1.jar
(68 KB at 3393.6 KB/sec)
Downloading: http://repo.maven.apache.org/maven2/org/apache/zookeeper/zookeeper/3.4.5/zookeeper-3.4.5.jar
Downloaded: http://repo.maven.apache.org/maven2/org/apache/curator/curator-framework/2.7.1/curator-framework-2.7.1.jar
(182 KB at 7909.0 KB/sec)
Downloading: http://repo.maven.apache.org/maven2/org/apache/hadoop/hadoop-common/2.7.2/hadoop-common-2.7.2-tests.jar
Downloaded: http://repo.maven.apache.org/maven2/com/google/code/findbugs/jsr305/3.0.0/jsr305-3.0.0.jar
(33 KB at 1536.0 KB/sec)
Downloading: http://repo.maven.apache.org/maven2/org/apache/hadoop/hadoop-hdfs/2.7.2/hadoop-hdfs-2.7.2.jar
Downloaded: http://repo.maven.apache.org/maven2/org/apache/curator/curator-recipes/2.7.1/curator-recipes-2.7.1.jar
(265 KB at 11000.2 KB/sec)
Downloading: http://repo.maven.apache.org/maven2/commons-daemon/commons-daemon/1.0.13/commons-daemon-1.0.13.jar
Downloaded: http://repo.maven.apache.org/maven2/commons-daemon/commons-daemon/1.0.13/commons-daemon-1.0.13.jar
(24 KB at 1029.2 KB/sec)
Downloading: http://repo.maven.apache.org/maven2/io/netty/netty/3.6.2.Final/netty-3.6.2.Final.jar
Downloaded: http://repo.maven.apache.org/maven2/org/apache/zookeeper/zookeeper/3.4.5/zookeeper-3.4.5.jar
(762 KB at 19042.3 KB/sec)
Downloading: http://repo.maven.apache.org/maven2/org/fusesource/leveldbjni/leveldbjni-all/1.8/leveldbjni-all-1.8.jar
Downloaded: http://repo.maven.apache.org/maven2/org/apache/hadoop/hadoop-common/2.7.2/hadoop-common-2.7.2-tests.jar
(1840 KB at 29197.5 KB/sec)
Downloading: http://repo.maven.apache.org/maven2/org/apache/hadoop/hadoop-hdfs/2.7.2/hadoop-hdfs-2.7.2-tests.jar
Downloaded: http://repo.maven.apache.org/maven2/org/apache/hadoop/hadoop-common/2.7.2/hadoop-common-2.7.2.jar
(3363 KB at 14877.6 KB/sec)
Downloaded: http://repo.maven.apache.org/maven2/io/netty/netty/3.6.2.Final/netty-3.6.2.Final.jar
(1172 KB at 18594.6 KB/sec)
Downloaded: http://repo.maven.apache.org/maven2/org/fusesource/leveldbjni/leveldbjni-all/1.8/leveldbjni-all-1.8.jar
(1022 KB at 17916.4 KB/sec)
Downloaded: http://repo.maven.apache.org/maven2/org/apache/hadoop/hadoop-hdfs/2.7.2/hadoop-hdfs-2.7.2-tests.jar
(3210 KB at 39621.1 KB/sec)
Downloaded: http://repo.maven.apache.org/maven2/org/apache/hadoop/hadoop-hdfs/2.7.2/hadoop-hdfs-2.7.2.jar
(8075 KB at 44611.0 KB/sec)
[INFO] ------------------------------------------------------------------------
[INFO] Reactor Summary:
[INFO] 
[INFO] bigtop-smokes ..................................... SUCCESS [16.677s]
[INFO] hadoopsmoke ....................................... FAILURE [3.145s]
[INFO] packagesmoke ...................................... SKIPPED
[INFO] httpfssmokes ...................................... SKIPPED
[INFO] ooziesmoke ........................................ SKIPPED
[INFO] hbasesmoke ........................................ SKIPPED
[INFO] flumesmoke ........................................ SKIPPED
[INFO] sqoopsmokes ....................................... SKIPPED
[INFO] mahoutsmoke ....................................... SKIPPED
[INFO] giraphsmoke ....................................... SKIPPED
[INFO] huesmoke .......................................... SKIPPED
[INFO] solrsmoke ......................................... SKIPPED
[INFO] crunchsmoke ....................................... SKIPPED
[INFO] datafusmoke ....................................... SKIPPED
[INFO] io-longevity ...................................... SKIPPED
[INFO] hcatalogsmoke ..................................... SKIPPED
[INFO] sparksmoke ........................................ SKIPPED
[INFO] phoenixsmoke ...................................... SKIPPED
[INFO] fatjar ............................................ SKIPPED
[INFO] ------------------------------------------------------------------------
[INFO] BUILD FAILURE
[INFO] ------------------------------------------------------------------------
[INFO] Total time: 29.151s
[INFO] Finished at: Fri May 20 22:20:09 UTC 2016
[INFO] Final Memory: 20M/244M
[INFO] ------------------------------------------------------------------------
Waiting for Jenkins to finish collecting data
[ERROR] Failed to execute goal on project hadoop-smoke: Could not resolve dependencies for
project org.apache.bigtop.itest:hadoop-smoke:jar:1.2.0-SNAPSHOT: Could not find artifact jdk.tools:jdk.tools:jar:1.7
at specified path /usr/lib/jvm/java-7-openjdk-amd64/jre/../lib/tools.jar -> [Help 1]
[ERROR] 
[ERROR] To see the full stack trace of the errors, re-run Maven with the -e switch.
[ERROR] Re-run Maven using the -X switch to enable full debug logging.
[ERROR] 
[ERROR] For more information about the errors and possible solutions, please read the following
articles:
[ERROR] [Help 1] http://cwiki.apache.org/confluence/display/MAVEN/DependencyResolutionException
[ERROR] 
[ERROR] After correcting the problems, you can resume the build with the command
[ERROR]   mvn <goals> -rf :hadoop-smoke
[JENKINS] Archiving <https://builds.apache.org/job/Bigtop-trunk-testartifacts/ws/bigtop-tests/test-artifacts/pom.xml>
to org.apache.bigtop.itest/bigtop-smokes/1.2.0-SNAPSHOT/bigtop-smokes-1.2.0-SNAPSHOT.pom
[JENKINS] Archiving <https://builds.apache.org/job/Bigtop-trunk-testartifacts/ws/bigtop-tests/test-artifacts/sqoop/pom.xml>
to org.apache.bigtop.itest/sqoop-smoke/1.2.0-SNAPSHOT/sqoop-smoke-1.2.0-SNAPSHOT.pom
[JENKINS] Archiving <https://builds.apache.org/job/Bigtop-trunk-testartifacts/ws/bigtop-tests/test-artifacts/hue/pom.xml>
to org.apache.bigtop.itest/hue-smoke/1.2.0-SNAPSHOT/hue-smoke-1.2.0-SNAPSHOT.pom
[JENKINS] Archiving <https://builds.apache.org/job/Bigtop-trunk-testartifacts/ws/bigtop-tests/test-artifacts/crunch/pom.xml>
to org.apache.bigtop.itest/crunch-smoke/1.2.0-SNAPSHOT/crunch-smoke-1.2.0-SNAPSHOT.pom
[JENKINS] Archiving <https://builds.apache.org/job/Bigtop-trunk-testartifacts/ws/bigtop-tests/test-artifacts/package/pom.xml>
to org.apache.bigtop.itest/package-smoke/1.2.0-SNAPSHOT/package-smoke-1.2.0-SNAPSHOT.pom
[JENKINS] Archiving <https://builds.apache.org/job/Bigtop-trunk-testartifacts/ws/bigtop-tests/test-artifacts/flume/pom.xml>
to org.apache.bigtop.itest/flume-smoke/1.2.0-SNAPSHOT/flume-smoke-1.2.0-SNAPSHOT.pom
[JENKINS] Archiving <https://builds.apache.org/job/Bigtop-trunk-testartifacts/ws/bigtop-tests/test-artifacts/httpfs/pom.xml>
to org.apache.bigtop.itest/httpfs-smoke/1.2.0-SNAPSHOT/httpfs-smoke-1.2.0-SNAPSHOT.pom
[JENKINS] Archiving <https://builds.apache.org/job/Bigtop-trunk-testartifacts/ws/bigtop-tests/test-artifacts/spark/pom.xml>
to org.apache.bigtop.itest/spark-smoke/1.2.0-SNAPSHOT/spark-smoke-1.2.0-SNAPSHOT.pom
[JENKINS] Archiving <https://builds.apache.org/job/Bigtop-trunk-testartifacts/ws/bigtop-tests/test-artifacts/hadoop/pom.xml>
to org.apache.bigtop.itest/hadoop-smoke/1.2.0-SNAPSHOT/hadoop-smoke-1.2.0-SNAPSHOT.pom
[JENKINS] Archiving <https://builds.apache.org/job/Bigtop-trunk-testartifacts/ws/bigtop-tests/test-artifacts/oozie/pom.xml>
to org.apache.bigtop.itest/oozie-smoke/1.2.0-SNAPSHOT/oozie-smoke-1.2.0-SNAPSHOT.pom
[JENKINS] Archiving <https://builds.apache.org/job/Bigtop-trunk-testartifacts/ws/bigtop-tests/test-artifacts/giraph/pom.xml>
to org.apache.bigtop.itest/giraph-smoke/1.2.0-SNAPSHOT/giraph-smoke-1.2.0-SNAPSHOT.pom
[JENKINS] Archiving <https://builds.apache.org/job/Bigtop-trunk-testartifacts/ws/bigtop-tests/test-artifacts/hcatalog/pom.xml>
to org.apache.bigtop.itest/hcatalog-smoke/1.2.0-SNAPSHOT/hcatalog-smoke-1.2.0-SNAPSHOT.pom
[JENKINS] Archiving <https://builds.apache.org/job/Bigtop-trunk-testartifacts/ws/bigtop-tests/test-artifacts/datafu/pom.xml>
to org.apache.bigtop.itest/datafu-smoke/1.2.0-SNAPSHOT/datafu-smoke-1.2.0-SNAPSHOT.pom
[JENKINS] Archiving <https://builds.apache.org/job/Bigtop-trunk-testartifacts/ws/bigtop-tests/test-artifacts/longevity/pom.xml>
to org.apache.bigtop.itest/io-longevity/1.2.0-SNAPSHOT/io-longevity-1.2.0-SNAPSHOT.pom
[JENKINS] Archiving <https://builds.apache.org/job/Bigtop-trunk-testartifacts/ws/bigtop-tests/test-artifacts/mahout/pom.xml>
to org.apache.bigtop.itest/mahout-smoke/1.2.0-SNAPSHOT/mahout-smoke-1.2.0-SNAPSHOT.pom
[JENKINS] Archiving <https://builds.apache.org/job/Bigtop-trunk-testartifacts/ws/bigtop-tests/test-artifacts/hbase/pom.xml>
to org.apache.bigtop.itest/hbase-smoke/1.2.0-SNAPSHOT/hbase-smoke-1.2.0-SNAPSHOT.pom
[JENKINS] Archiving <https://builds.apache.org/job/Bigtop-trunk-testartifacts/ws/bigtop-tests/test-artifacts/solr/pom.xml>
to org.apache.bigtop.itest/solr-smoke/1.2.0-SNAPSHOT/solr-smoke-1.2.0-SNAPSHOT.pom
[JENKINS] Archiving <https://builds.apache.org/job/Bigtop-trunk-testartifacts/ws/bigtop-tests/test-artifacts/phoenix/pom.xml>
to org.apache.bigtop.itest/phoenix-smoke/1.2.0-SNAPSHOT/phoenix-smoke-1.2.0-SNAPSHOT.pom
[JENKINS] Archiving <https://builds.apache.org/job/Bigtop-trunk-testartifacts/ws/bigtop-tests/test-artifacts/fatjar/pom.xml>
to org.apache.bigtop.itest/fat-smoke/1.2.0-SNAPSHOT/fat-smoke-1.2.0-SNAPSHOT.pom
Sending e-mails to: ci@bigtop.apache.org
channel stopped

Mime
View raw message