bigtop-ci mailing list archives

Site index · List index
Message view « Date » · « Thread »
Top « Date » · « Thread »
From Apache Jenkins Server <jenk...@builds.apache.org>
Subject Build failed in Jenkins: Bigtop-trunk-test-execution #1882
Date Fri, 20 May 2016 23:00:45 GMT
See <https://builds.apache.org/job/Bigtop-trunk-test-execution/1882/changes>

Changes:

[cos] BIGTOP-2442: remove init_hdfs refs from resourcemanager role

------------------------------------------
[...truncated 2298 lines...]
5944/6807 KB   
5948/6807 KB   
5952/6807 KB   
5956/6807 KB   
5960/6807 KB   
5964/6807 KB   
5968/6807 KB   
5972/6807 KB   
5976/6807 KB   
5980/6807 KB   
5984/6807 KB   
5988/6807 KB   
5992/6807 KB   
5996/6807 KB   
6000/6807 KB   
6004/6807 KB   
6008/6807 KB   
6012/6807 KB   
6016/6807 KB   
6020/6807 KB   
6024/6807 KB   
6028/6807 KB   
6032/6807 KB   
6036/6807 KB   
6040/6807 KB   
6044/6807 KB   
6048/6807 KB   
6052/6807 KB   
6056/6807 KB   
6060/6807 KB   
6064/6807 KB   
6068/6807 KB   
6072/6807 KB   
6076/6807 KB   
6080/6807 KB   
6084/6807 KB   
6088/6807 KB   
6092/6807 KB   
6096/6807 KB   
6100/6807 KB   
6104/6807 KB   
6108/6807 KB   
6112/6807 KB   
6116/6807 KB   
6120/6807 KB   
6124/6807 KB   
6128/6807 KB   
6132/6807 KB   
6136/6807 KB   
6140/6807 KB   
6144/6807 KB   
6148/6807 KB   
6152/6807 KB   
6156/6807 KB   
6160/6807 KB   
6164/6807 KB   
6168/6807 KB   
6172/6807 KB   
6176/6807 KB   
6180/6807 KB   
6184/6807 KB   
6188/6807 KB   
6192/6807 KB   
6196/6807 KB   
6200/6807 KB   
6204/6807 KB   
6208/6807 KB   
6212/6807 KB   
6216/6807 KB   
6220/6807 KB   
6224/6807 KB   
6228/6807 KB   
6232/6807 KB   
6236/6807 KB   
6240/6807 KB   
6244/6807 KB   
6248/6807 KB   
6252/6807 KB   
6256/6807 KB   
6260/6807 KB   
6264/6807 KB   
6268/6807 KB   
6272/6807 KB   
6276/6807 KB   
6280/6807 KB   
6284/6807 KB   
6288/6807 KB   
6292/6807 KB   
6296/6807 KB   
6300/6807 KB   
6304/6807 KB   
6308/6807 KB   
6312/6807 KB   
6316/6807 KB   
6320/6807 KB   
6324/6807 KB   
6328/6807 KB   
6332/6807 KB   
6336/6807 KB   
6340/6807 KB   
6344/6807 KB   
6348/6807 KB   
6352/6807 KB   
6356/6807 KB   
6360/6807 KB   
6364/6807 KB   
6368/6807 KB   
6372/6807 KB   
6376/6807 KB   
6380/6807 KB   
6384/6807 KB   
6388/6807 KB   
6392/6807 KB   
6396/6807 KB   
6400/6807 KB   
6404/6807 KB   
6408/6807 KB   
6412/6807 KB   
6416/6807 KB   
6420/6807 KB   
6424/6807 KB   
6428/6807 KB   
6432/6807 KB   
6436/6807 KB   
6440/6807 KB   
6444/6807 KB   
6448/6807 KB   
6452/6807 KB   
6456/6807 KB   
6460/6807 KB   
6464/6807 KB   
6468/6807 KB   
6472/6807 KB   
6476/6807 KB   
6480/6807 KB   
6484/6807 KB   
6488/6807 KB   
6492/6807 KB   
6496/6807 KB   
6500/6807 KB   
6504/6807 KB   
6508/6807 KB   
6512/6807 KB   
6516/6807 KB   
6520/6807 KB   
6524/6807 KB   
6528/6807 KB   
6532/6807 KB   
6536/6807 KB   
6540/6807 KB   
6544/6807 KB   
6548/6807 KB   
6552/6807 KB   
6556/6807 KB   
6560/6807 KB   
6564/6807 KB   
6568/6807 KB   
6572/6807 KB   
6576/6807 KB   
6580/6807 KB   
6584/6807 KB   
6588/6807 KB   
6592/6807 KB   
6596/6807 KB   
6600/6807 KB   
6604/6807 KB   
6608/6807 KB   
6612/6807 KB   
6616/6807 KB   
6620/6807 KB   
6624/6807 KB   
6628/6807 KB   
6632/6807 KB   
6636/6807 KB   
6640/6807 KB   
6644/6807 KB   
6648/6807 KB   
6652/6807 KB   
6656/6807 KB   
6660/6807 KB   
6664/6807 KB   
6668/6807 KB   
6672/6807 KB   
6676/6807 KB   
6680/6807 KB   
6684/6807 KB   
6688/6807 KB   
6692/6807 KB   
6696/6807 KB   
6700/6807 KB   
6704/6807 KB   
6708/6807 KB   
6712/6807 KB   
6716/6807 KB   
6720/6807 KB   
6724/6807 KB   
6728/6807 KB   
6732/6807 KB   
6736/6807 KB   
6740/6807 KB   
6744/6807 KB   
6748/6807 KB   
6752/6807 KB   
6756/6807 KB   
6760/6807 KB   
6764/6807 KB   
6768/6807 KB   
6772/6807 KB   
6776/6807 KB   
6780/6807 KB   
6784/6807 KB   
6788/6807 KB   
6792/6807 KB   
6796/6807 KB   
6800/6807 KB   
6804/6807 KB   
6807/6807 KB   
               
Downloaded: http://repo.maven.apache.org/maven2/org/codehaus/groovy/groovy-all/2.4.3/groovy-all-2.4.3.jar
(6807 KB at 28125.3 KB/sec)
[INFO] 
[INFO] --- maven-install-plugin:2.3:install (default-install) @ stacks-common ---
[INFO] Installing <https://builds.apache.org/job/Bigtop-trunk-test-execution/ws/bigtop-tests/test-execution/common/pom.xml>
to /home/jenkins/.m2/repository/org/apache/bigtop/itest/stacks-common/1.2.0-SNAPSHOT/stacks-common-1.2.0-SNAPSHOT.pom
[INFO] 
[INFO] --- maven-deploy-plugin:2.5:deploy (default-deploy) @ stacks-common ---
Downloading: https://repository.apache.org/content/repositories/snapshots/org/apache/bigtop/itest/stacks-common/1.2.0-SNAPSHOT/maven-metadata.xml
               
[WARNING] Could not transfer metadata org.apache.bigtop.itest:stacks-common:1.2.0-SNAPSHOT/maven-metadata.xml
from/to apache.snapshots.https (https://repository.apache.org/content/repositories/snapshots):
java.lang.RuntimeException: Could not generate DH keypair
[INFO] ------------------------------------------------------------------------
[INFO] Reactor Summary:
[INFO] 
[INFO] stacks-validation-common .......................... FAILURE [2.669s]
[INFO] smoke-tests-conf .................................. SKIPPED
[INFO] packagesmokes ..................................... SKIPPED
[INFO] bigtop-smokes ..................................... SKIPPED
[INFO] ------------------------------------------------------------------------
[INFO] BUILD FAILURE
[INFO] ------------------------------------------------------------------------
[INFO] Total time: 3.108s
[INFO] Finished at: Fri May 20 23:00:50 UTC 2016
[INFO] Final Memory: 8M/109M
[INFO] ------------------------------------------------------------------------
[ERROR] Failed to execute goal org.apache.maven.plugins:maven-deploy-plugin:2.5:deploy (default-deploy)
on project stacks-common: Failed to retrieve remote metadata org.apache.bigtop.itest:stacks-common:1.2.0-SNAPSHOT/maven-metadata.xml:
Could not transfer metadata org.apache.bigtop.itest:stacks-common:1.2.0-SNAPSHOT/maven-metadata.xml
from/to apache.snapshots.https (https://repository.apache.org/content/repositories/snapshots):
java.lang.RuntimeException: Could not generate DH keypair: Prime size must be multiple of
64, and can only range from 512 to 1024 (inclusive) -> [Help 1]
[ERROR] 
[ERROR] To see the full stack trace of the errors, re-run Maven with the -e switch.
[ERROR] Re-run Maven using the -X switch to enable full debug logging.
[ERROR] 
[ERROR] For more information about the errors and possible solutions, please read the following
articles:
[ERROR] [Help 1] http://cwiki.apache.org/confluence/display/MAVEN/MojoExecutionException
Build step 'Execute shell' marked build as failure

Mime
View raw message