bigtop-ci mailing list archives

Site index · List index
Message view « Date » · « Thread »
Top « Date » · « Thread »
From Apache Jenkins Server <jenk...@builds.apache.org>
Subject Build failed in Jenkins: Bigtop-trunk-test-execution #1859
Date Mon, 18 Apr 2016 21:24:37 GMT
See <https://builds.apache.org/job/Bigtop-trunk-test-execution/1859/changes>

Changes:

[rvs] BIGTOP-2393. Add ARM64 support for build environment

------------------------------------------
[...truncated 3392 lines...]
5738/6230 KB   
5742/6230 KB   
5746/6230 KB   
5750/6230 KB   
5754/6230 KB   
5758/6230 KB   
5762/6230 KB   
5766/6230 KB   
5770/6230 KB   
5774/6230 KB   
5778/6230 KB   
5782/6230 KB   
5786/6230 KB   
5790/6230 KB   
5794/6230 KB   
5798/6230 KB   
5802/6230 KB   
5806/6230 KB   
5810/6230 KB   
5814/6230 KB   
5818/6230 KB   
5822/6230 KB   
5826/6230 KB   
5830/6230 KB   
5834/6230 KB   
5838/6230 KB   
5842/6230 KB   
5846/6230 KB   
5850/6230 KB   
5854/6230 KB   
5858/6230 KB   
5862/6230 KB   
5866/6230 KB   
5870/6230 KB   
5874/6230 KB   
5878/6230 KB   
5882/6230 KB   
5886/6230 KB   
5890/6230 KB   
5894/6230 KB   
5898/6230 KB   
5902/6230 KB   
5906/6230 KB   
5910/6230 KB   
5914/6230 KB   
5918/6230 KB   
5922/6230 KB   
5926/6230 KB   
5930/6230 KB   
5934/6230 KB   
5938/6230 KB   
5942/6230 KB   
5946/6230 KB   
5950/6230 KB   
5954/6230 KB   
5958/6230 KB   
5962/6230 KB   
5966/6230 KB   
5970/6230 KB   
5974/6230 KB   
5978/6230 KB   
5982/6230 KB   
5986/6230 KB   
5990/6230 KB   
5994/6230 KB   
5998/6230 KB   
6002/6230 KB   
6006/6230 KB   
6010/6230 KB   
6014/6230 KB   
6018/6230 KB   
6022/6230 KB   
6026/6230 KB   
6030/6230 KB   
6034/6230 KB   
6038/6230 KB   
6042/6230 KB   
6046/6230 KB   
6050/6230 KB   
6054/6230 KB   
6058/6230 KB   
6062/6230 KB   
6066/6230 KB   
6070/6230 KB   
6074/6230 KB   
6078/6230 KB   
6082/6230 KB   
6086/6230 KB   
6090/6230 KB   
6094/6230 KB   
6098/6230 KB   
6102/6230 KB   
6106/6230 KB   
6110/6230 KB   
6114/6230 KB   
6118/6230 KB   
6122/6230 KB   
6126/6230 KB   
6130/6230 KB   
6134/6230 KB   
6138/6230 KB   
6142/6230 KB   
6146/6230 KB   
6150/6230 KB   
6154/6230 KB   
6158/6230 KB   
6162/6230 KB   
6166/6230 KB   
6170/6230 KB   
6174/6230 KB   
6178/6230 KB   
6182/6230 KB   
6186/6230 KB   
6190/6230 KB   
6194/6230 KB   
6198/6230 KB   
6202/6230 KB   
6206/6230 KB   
6210/6230 KB   
6214/6230 KB   
6218/6230 KB   
6222/6230 KB   
6226/6230 KB   
6230/6230 KB   
               
Downloaded: http://repo.maven.apache.org/maven2/org/codehaus/groovy/groovy-all/2.1.8/groovy-all-2.1.8.jar
(6230 KB at 28707.8 KB/sec)
[INFO] 
[INFO] --- maven-install-plugin:2.3:install (default-install) @ stacks-common ---
Downloading: http://repo.maven.apache.org/maven2/org/codehaus/plexus/plexus-utils/1.5.6/plexus-utils-1.5.6.pom
4/6 KB         
6/6 KB   
         
Downloaded: http://repo.maven.apache.org/maven2/org/codehaus/plexus/plexus-utils/1.5.6/plexus-utils-1.5.6.pom
(6 KB at 258.9 KB/sec)
Downloading: http://repo.maven.apache.org/maven2/org/codehaus/plexus/plexus/1.0.12/plexus-1.0.12.pom
4/10 KB   
8/10 KB   
10/10 KB   
           
Downloaded: http://repo.maven.apache.org/maven2/org/codehaus/plexus/plexus/1.0.12/plexus-1.0.12.pom
(10 KB at 503.7 KB/sec)
Downloading: http://repo.maven.apache.org/maven2/org/codehaus/plexus/plexus-digest/1.0/plexus-digest-1.0.pom
2/2 KB     
         
Downloaded: http://repo.maven.apache.org/maven2/org/codehaus/plexus/plexus-digest/1.0/plexus-digest-1.0.pom
(2 KB at 54.4 KB/sec)
Downloading: http://repo.maven.apache.org/maven2/org/codehaus/plexus/plexus-components/1.1.7/plexus-components-1.1.7.pom
4/5 KB   
5/5 KB   
         
Downloaded: http://repo.maven.apache.org/maven2/org/codehaus/plexus/plexus-components/1.1.7/plexus-components-1.1.7.pom
(5 KB at 255.7 KB/sec)
Downloading: http://repo.maven.apache.org/maven2/org/codehaus/plexus/plexus-utils/1.5.6/plexus-utils-1.5.6.jar
Downloading: http://repo.maven.apache.org/maven2/org/codehaus/plexus/plexus-digest/1.0/plexus-digest-1.0.jar
4/245 KB   
5/245 KB   
9/245 KB   
13/245 KB   
17/245 KB   
21/245 KB   
25/245 KB   
29/245 KB   
33/245 KB   
37/245 KB   
41/245 KB   
45/245 KB   
49/245 KB   
53/245 KB   
57/245 KB   
61/245 KB   
65/245 KB   
69/245 KB   
73/245 KB   
77/245 KB   
81/245 KB   
85/245 KB   
89/245 KB   
93/245 KB   
97/245 KB   
101/245 KB   
105/245 KB   
109/245 KB   
4/12 KB   109/245 KB   
4/12 KB   113/245 KB   
4/12 KB   117/245 KB   
8/12 KB   117/245 KB   
8/12 KB   121/245 KB   
12/12 KB   121/245 KB   
12/12 KB   125/245 KB   
12/12 KB   125/245 KB   
12/12 KB   129/245 KB   
12/12 KB   133/245 KB   
12/12 KB   137/245 KB   
12/12 KB   141/245 KB   
12/12 KB   145/245 KB   
12/12 KB   149/245 KB   
12/12 KB   153/245 KB   
12/12 KB   157/245 KB   
12/12 KB   161/245 KB   
12/12 KB   165/245 KB   
12/12 KB   169/245 KB   
12/12 KB   173/245 KB   
12/12 KB   177/245 KB   
12/12 KB   181/245 KB   
12/12 KB   185/245 KB   
12/12 KB   189/245 KB   
12/12 KB   193/245 KB   
12/12 KB   197/245 KB   
12/12 KB   201/245 KB   
12/12 KB   205/245 KB   
12/12 KB   209/245 KB   
12/12 KB   213/245 KB   
12/12 KB   217/245 KB   
12/12 KB   221/245 KB   
12/12 KB   225/245 KB   
12/12 KB   229/245 KB   
12/12 KB   233/245 KB   
12/12 KB   237/245 KB   
12/12 KB   241/245 KB   
12/12 KB   245/245 KB   
12/12 KB   245/245 KB   
                        
Downloaded: http://repo.maven.apache.org/maven2/org/codehaus/plexus/plexus-digest/1.0/plexus-digest-1.0.jar
(12 KB at 503.5 KB/sec)
                        
Downloaded: http://repo.maven.apache.org/maven2/org/codehaus/plexus/plexus-utils/1.5.6/plexus-utils-1.5.6.jar
(245 KB at 9410.5 KB/sec)
[INFO] Installing <https://builds.apache.org/job/Bigtop-trunk-test-execution/ws/bigtop-tests/test-execution/common/pom.xml>
to /home/jenkins/.m2/repository/org/apache/bigtop/itest/stacks-common/1.2.0-SNAPSHOT/stacks-common-1.2.0-SNAPSHOT.pom
[INFO] 
[INFO] --- maven-deploy-plugin:2.5:deploy (default-deploy) @ stacks-common ---
Downloading: https://repository.apache.org/content/repositories/snapshots/org/apache/bigtop/itest/stacks-common/1.2.0-SNAPSHOT/maven-metadata.xml
                        
[WARNING] Could not transfer metadata org.apache.bigtop.itest:stacks-common:1.2.0-SNAPSHOT/maven-metadata.xml
from/to apache.snapshots.https (https://repository.apache.org/content/repositories/snapshots):
java.lang.RuntimeException: Could not generate DH keypair
[INFO] ------------------------------------------------------------------------
[INFO] Reactor Summary:
[INFO] 
[INFO] stacks-validation-common .......................... FAILURE [6.167s]
[INFO] smoke-tests-conf .................................. SKIPPED
[INFO] packagesmokes ..................................... SKIPPED
[INFO] bigtop-smokes ..................................... SKIPPED
[INFO] ------------------------------------------------------------------------
[INFO] BUILD FAILURE
[INFO] ------------------------------------------------------------------------
[INFO] Total time: 6.619s
[INFO] Finished at: Mon Apr 18 21:24:39 UTC 2016
[INFO] Final Memory: 8M/71M
[INFO] ------------------------------------------------------------------------
[ERROR] Failed to execute goal org.apache.maven.plugins:maven-deploy-plugin:2.5:deploy (default-deploy)
on project stacks-common: Failed to retrieve remote metadata org.apache.bigtop.itest:stacks-common:1.2.0-SNAPSHOT/maven-metadata.xml:
Could not transfer metadata org.apache.bigtop.itest:stacks-common:1.2.0-SNAPSHOT/maven-metadata.xml
from/to apache.snapshots.https (https://repository.apache.org/content/repositories/snapshots):
java.lang.RuntimeException: Could not generate DH keypair: Prime size must be multiple of
64, and can only range from 512 to 1024 (inclusive) -> [Help 1]
[ERROR] 
[ERROR] To see the full stack trace of the errors, re-run Maven with the -e switch.
[ERROR] Re-run Maven using the -X switch to enable full debug logging.
[ERROR] 
[ERROR] For more information about the errors and possible solutions, please read the following
articles:
[ERROR] [Help 1] http://cwiki.apache.org/confluence/display/MAVEN/MojoExecutionException
Build step 'Execute shell' marked build as failure

Mime
View raw message