bigtop-ci mailing list archives

Site index · List index
Message view « Date » · « Thread »
Top « Date » · « Thread »
From Apache Jenkins Server <jenk...@builds.apache.org>
Subject Build failed in Jenkins: Bigtop-trunk-test-execution #1861
Date Fri, 22 Apr 2016 01:16:47 GMT
See <https://builds.apache.org/job/Bigtop-trunk-test-execution/1861/changes>

Changes:

[rvs] BIGTOP-2404. puppetize.sh fails on Ubuntu 14.04 because of the lack of

------------------------------------------
[...truncated 3382 lines...]
5736/6230 KB   
5740/6230 KB   
5744/6230 KB   
5748/6230 KB   
5752/6230 KB   
5756/6230 KB   
5760/6230 KB   
5764/6230 KB   
5768/6230 KB   
5772/6230 KB   
5776/6230 KB   
5780/6230 KB   
5784/6230 KB   
5788/6230 KB   
5792/6230 KB   
5796/6230 KB   
5800/6230 KB   
5804/6230 KB   
5808/6230 KB   
5812/6230 KB   
5816/6230 KB   
5820/6230 KB   
5824/6230 KB   
5828/6230 KB   
5832/6230 KB   
5836/6230 KB   
5840/6230 KB   
5844/6230 KB   
5848/6230 KB   
5852/6230 KB   
5856/6230 KB   
5860/6230 KB   
5864/6230 KB   
5868/6230 KB   
5872/6230 KB   
5876/6230 KB   
5880/6230 KB   
5884/6230 KB   
5888/6230 KB   
5892/6230 KB   
5896/6230 KB   
5900/6230 KB   
5904/6230 KB   
5908/6230 KB   
5912/6230 KB   
5916/6230 KB   
5920/6230 KB   
5924/6230 KB   
5928/6230 KB   
5932/6230 KB   
5936/6230 KB   
5940/6230 KB   
5944/6230 KB   
5948/6230 KB   
5952/6230 KB   
5956/6230 KB   
5960/6230 KB   
5964/6230 KB   
5968/6230 KB   
5972/6230 KB   
5976/6230 KB   
5980/6230 KB   
5984/6230 KB   
5988/6230 KB   
5992/6230 KB   
5996/6230 KB   
6000/6230 KB   
6004/6230 KB   
6008/6230 KB   
6012/6230 KB   
6016/6230 KB   
6020/6230 KB   
6024/6230 KB   
6028/6230 KB   
6032/6230 KB   
6036/6230 KB   
6040/6230 KB   
6044/6230 KB   
6048/6230 KB   
6052/6230 KB   
6056/6230 KB   
6060/6230 KB   
6064/6230 KB   
6068/6230 KB   
6072/6230 KB   
6076/6230 KB   
6080/6230 KB   
6084/6230 KB   
6088/6230 KB   
6092/6230 KB   
6096/6230 KB   
6100/6230 KB   
6104/6230 KB   
6108/6230 KB   
6112/6230 KB   
6116/6230 KB   
6120/6230 KB   
6124/6230 KB   
6128/6230 KB   
6132/6230 KB   
6136/6230 KB   
6140/6230 KB   
6144/6230 KB   
6148/6230 KB   
6152/6230 KB   
6156/6230 KB   
6160/6230 KB   
6164/6230 KB   
6168/6230 KB   
6172/6230 KB   
6176/6230 KB   
6180/6230 KB   
6184/6230 KB   
6188/6230 KB   
6192/6230 KB   
6196/6230 KB   
6200/6230 KB   
6204/6230 KB   
6208/6230 KB   
6212/6230 KB   
6216/6230 KB   
6220/6230 KB   
6224/6230 KB   
6228/6230 KB   
6230/6230 KB   
               
Downloaded: http://repo.maven.apache.org/maven2/org/codehaus/groovy/groovy-all/2.1.8/groovy-all-2.1.8.jar
(6230 KB at 29384.9 KB/sec)
[INFO] 
[INFO] --- maven-install-plugin:2.3:install (default-install) @ stacks-common ---
Downloading: http://repo.maven.apache.org/maven2/org/codehaus/plexus/plexus-utils/1.5.6/plexus-utils-1.5.6.pom
4/6 KB         
6/6 KB   
         
Downloaded: http://repo.maven.apache.org/maven2/org/codehaus/plexus/plexus-utils/1.5.6/plexus-utils-1.5.6.pom
(6 KB at 167.0 KB/sec)
Downloading: http://repo.maven.apache.org/maven2/org/codehaus/plexus/plexus/1.0.12/plexus-1.0.12.pom
4/10 KB   
8/10 KB   
10/10 KB   
           
Downloaded: http://repo.maven.apache.org/maven2/org/codehaus/plexus/plexus/1.0.12/plexus-1.0.12.pom
(10 KB at 1196.3 KB/sec)
Downloading: http://repo.maven.apache.org/maven2/org/codehaus/plexus/plexus-digest/1.0/plexus-digest-1.0.pom
2/2 KB     
         
Downloaded: http://repo.maven.apache.org/maven2/org/codehaus/plexus/plexus-digest/1.0/plexus-digest-1.0.pom
(2 KB at 129.3 KB/sec)
Downloading: http://repo.maven.apache.org/maven2/org/codehaus/plexus/plexus-components/1.1.7/plexus-components-1.1.7.pom
4/5 KB   
5/5 KB   
         
Downloaded: http://repo.maven.apache.org/maven2/org/codehaus/plexus/plexus-components/1.1.7/plexus-components-1.1.7.pom
(5 KB at 607.3 KB/sec)
Downloading: http://repo.maven.apache.org/maven2/org/codehaus/plexus/plexus-utils/1.5.6/plexus-utils-1.5.6.jar
Downloading: http://repo.maven.apache.org/maven2/org/codehaus/plexus/plexus-digest/1.0/plexus-digest-1.0.jar
4/245 KB   
8/245 KB   
12/245 KB   
16/245 KB   
20/245 KB   
24/245 KB   
28/245 KB   
32/245 KB   
36/245 KB   
40/245 KB   
44/245 KB   
48/245 KB   
52/245 KB   
56/245 KB   
60/245 KB   
64/245 KB   
68/245 KB   
72/245 KB   
76/245 KB   
80/245 KB   
84/245 KB   
88/245 KB   
92/245 KB   
96/245 KB   
100/245 KB   
104/245 KB   
108/245 KB   
112/245 KB   
116/245 KB   
120/245 KB   
124/245 KB   
128/245 KB   
132/245 KB   
136/245 KB   
140/245 KB   
144/245 KB   
148/245 KB   
152/245 KB   
156/245 KB   
160/245 KB   
164/245 KB   
168/245 KB   
172/245 KB   
176/245 KB   
180/245 KB   
184/245 KB   
188/245 KB   
192/245 KB   
196/245 KB   
200/245 KB   
204/245 KB   
204/245 KB   4/12 KB   
208/245 KB   4/12 KB   
212/245 KB   4/12 KB   
212/245 KB   8/12 KB   
216/245 KB   8/12 KB   
216/245 KB   12/12 KB   
220/245 KB   12/12 KB   
220/245 KB   12/12 KB   
224/245 KB   12/12 KB   
228/245 KB   12/12 KB   
232/245 KB   12/12 KB   
236/245 KB   12/12 KB   
240/245 KB   12/12 KB   
244/245 KB   12/12 KB   
245/245 KB   12/12 KB   
                        
Downloaded: http://repo.maven.apache.org/maven2/org/codehaus/plexus/plexus-digest/1.0/plexus-digest-1.0.jar
(12 KB at 827.1 KB/sec)
                        
Downloaded: http://repo.maven.apache.org/maven2/org/codehaus/plexus/plexus-utils/1.5.6/plexus-utils-1.5.6.jar
(245 KB at 16311.6 KB/sec)
[INFO] Installing <https://builds.apache.org/job/Bigtop-trunk-test-execution/ws/bigtop-tests/test-execution/common/pom.xml>
to /home/jenkins/.m2/repository/org/apache/bigtop/itest/stacks-common/1.2.0-SNAPSHOT/stacks-common-1.2.0-SNAPSHOT.pom
[INFO] 
[INFO] --- maven-deploy-plugin:2.5:deploy (default-deploy) @ stacks-common ---
Downloading: https://repository.apache.org/content/repositories/snapshots/org/apache/bigtop/itest/stacks-common/1.2.0-SNAPSHOT/maven-metadata.xml
                        
[WARNING] Could not transfer metadata org.apache.bigtop.itest:stacks-common:1.2.0-SNAPSHOT/maven-metadata.xml
from/to apache.snapshots.https (https://repository.apache.org/content/repositories/snapshots):
java.lang.RuntimeException: Could not generate DH keypair
[INFO] ------------------------------------------------------------------------
[INFO] Reactor Summary:
[INFO] 
[INFO] stacks-validation-common .......................... FAILURE [4.463s]
[INFO] smoke-tests-conf .................................. SKIPPED
[INFO] packagesmokes ..................................... SKIPPED
[INFO] bigtop-smokes ..................................... SKIPPED
[INFO] ------------------------------------------------------------------------
[INFO] BUILD FAILURE
[INFO] ------------------------------------------------------------------------
[INFO] Total time: 4.926s
[INFO] Finished at: Fri Apr 22 01:16:52 UTC 2016
[INFO] Final Memory: 9M/145M
[INFO] ------------------------------------------------------------------------
[ERROR] Failed to execute goal org.apache.maven.plugins:maven-deploy-plugin:2.5:deploy (default-deploy)
on project stacks-common: Failed to retrieve remote metadata org.apache.bigtop.itest:stacks-common:1.2.0-SNAPSHOT/maven-metadata.xml:
Could not transfer metadata org.apache.bigtop.itest:stacks-common:1.2.0-SNAPSHOT/maven-metadata.xml
from/to apache.snapshots.https (https://repository.apache.org/content/repositories/snapshots):
java.lang.RuntimeException: Could not generate DH keypair: Prime size must be multiple of
64, and can only range from 512 to 1024 (inclusive) -> [Help 1]
[ERROR] 
[ERROR] To see the full stack trace of the errors, re-run Maven with the -e switch.
[ERROR] Re-run Maven using the -X switch to enable full debug logging.
[ERROR] 
[ERROR] For more information about the errors and possible solutions, please read the following
articles:
[ERROR] [Help 1] http://cwiki.apache.org/confluence/display/MAVEN/MojoExecutionException
Build step 'Execute shell' marked build as failure

Mime
View raw message