bigtop-ci mailing list archives

Site index · List index
Message view « Date » · « Thread »
Top « Date » · « Thread »
From Apache Jenkins Server <jenk...@builds.apache.org>
Subject Build failed in Jenkins: Bigtop-trunk-test-execution #1837
Date Fri, 18 Mar 2016 09:52:23 GMT
See <https://builds.apache.org/job/Bigtop-trunk-test-execution/1837/changes>

Changes:

[ywkim] BIGTOP-2316. Adding puppet recipes for apache apex.

[ywkim] BIGTOP-2359. Add .DS_Store to .gitignore

------------------------------------------
[...truncated 1736 lines...]
5368/6230 KB   
5372/6230 KB   
5376/6230 KB   
5380/6230 KB   
5384/6230 KB   
5388/6230 KB   
5392/6230 KB   
5396/6230 KB   
5400/6230 KB   
5404/6230 KB   
5408/6230 KB   
5412/6230 KB   
5416/6230 KB   
5420/6230 KB   
5424/6230 KB   
5428/6230 KB   
5432/6230 KB   
5436/6230 KB   
5440/6230 KB   
5444/6230 KB   
5448/6230 KB   
5452/6230 KB   
5456/6230 KB   
5460/6230 KB   
5464/6230 KB   
5468/6230 KB   
5472/6230 KB   
5476/6230 KB   
5480/6230 KB   
5484/6230 KB   
5488/6230 KB   
5492/6230 KB   
5496/6230 KB   
5500/6230 KB   
5504/6230 KB   
5508/6230 KB   
5512/6230 KB   
5516/6230 KB   
5520/6230 KB   
5524/6230 KB   
5528/6230 KB   
5532/6230 KB   
5536/6230 KB   
5540/6230 KB   
5544/6230 KB   
5548/6230 KB   
5552/6230 KB   
5556/6230 KB   
5560/6230 KB   
5564/6230 KB   
5568/6230 KB   
5572/6230 KB   
5576/6230 KB   
5580/6230 KB   
5584/6230 KB   
5588/6230 KB   
5592/6230 KB   
5596/6230 KB   
5600/6230 KB   
5604/6230 KB   
5608/6230 KB   
5612/6230 KB   
5616/6230 KB   
5620/6230 KB   
5624/6230 KB   
5628/6230 KB   
5632/6230 KB   
5636/6230 KB   
5640/6230 KB   
5644/6230 KB   
5648/6230 KB   
5652/6230 KB   
5656/6230 KB   
5660/6230 KB   
5664/6230 KB   
5668/6230 KB   
5672/6230 KB   
5676/6230 KB   
5680/6230 KB   
5684/6230 KB   
5688/6230 KB   
5692/6230 KB   
5696/6230 KB   
5700/6230 KB   
5704/6230 KB   
5708/6230 KB   
5712/6230 KB   
5716/6230 KB   
5720/6230 KB   
5724/6230 KB   
5728/6230 KB   
5732/6230 KB   
5736/6230 KB   
5740/6230 KB   
5744/6230 KB   
5748/6230 KB   
5752/6230 KB   
5756/6230 KB   
5760/6230 KB   
5764/6230 KB   
5768/6230 KB   
5772/6230 KB   
5776/6230 KB   
5780/6230 KB   
5784/6230 KB   
5788/6230 KB   
5792/6230 KB   
5796/6230 KB   
5800/6230 KB   
5804/6230 KB   
5808/6230 KB   
5812/6230 KB   
5816/6230 KB   
5820/6230 KB   
5824/6230 KB   
5828/6230 KB   
5832/6230 KB   
5836/6230 KB   
5840/6230 KB   
5844/6230 KB   
5848/6230 KB   
5852/6230 KB   
5856/6230 KB   
5860/6230 KB   
5864/6230 KB   
5868/6230 KB   
5872/6230 KB   
5876/6230 KB   
5880/6230 KB   
5884/6230 KB   
5888/6230 KB   
5892/6230 KB   
5896/6230 KB   
5900/6230 KB   
5904/6230 KB   
5908/6230 KB   
5912/6230 KB   
5916/6230 KB   
5920/6230 KB   
5924/6230 KB   
5928/6230 KB   
5932/6230 KB   
5936/6230 KB   
5940/6230 KB   
5944/6230 KB   
5948/6230 KB   
5952/6230 KB   
5956/6230 KB   
5960/6230 KB   
5964/6230 KB   
5968/6230 KB   
5972/6230 KB   
5976/6230 KB   
5980/6230 KB   
5984/6230 KB   
5988/6230 KB   
5992/6230 KB   
5996/6230 KB   
6000/6230 KB   
6004/6230 KB   
6008/6230 KB   
6012/6230 KB   
6016/6230 KB   
6020/6230 KB   
6024/6230 KB   
6028/6230 KB   
6032/6230 KB   
6036/6230 KB   
6040/6230 KB   
6044/6230 KB   
6048/6230 KB   
6052/6230 KB   
6056/6230 KB   
6060/6230 KB   
6064/6230 KB   
6068/6230 KB   
6072/6230 KB   
6076/6230 KB   
6080/6230 KB   
6084/6230 KB   
6088/6230 KB   
6092/6230 KB   
6096/6230 KB   
6100/6230 KB   
6104/6230 KB   
6108/6230 KB   
6112/6230 KB   
6116/6230 KB   
6120/6230 KB   
6124/6230 KB   
6128/6230 KB   
6132/6230 KB   
6136/6230 KB   
6140/6230 KB   
6144/6230 KB   
6148/6230 KB   
6152/6230 KB   
6156/6230 KB   
6160/6230 KB   
6164/6230 KB   
6168/6230 KB   
6172/6230 KB   
6176/6230 KB   
6180/6230 KB   
6184/6230 KB   
6188/6230 KB   
6192/6230 KB   
6196/6230 KB   
6200/6230 KB   
6204/6230 KB   
6208/6230 KB   
6212/6230 KB   
6216/6230 KB   
6220/6230 KB   
6224/6230 KB   
6228/6230 KB   
6230/6230 KB   
               
Downloaded: http://repo.maven.apache.org/maven2/org/codehaus/groovy/groovy-all/2.1.8/groovy-all-2.1.8.jar
(6230 KB at 13999.1 KB/sec)
[INFO] 
[INFO] --- maven-install-plugin:2.3:install (default-install) @ stacks-common ---
[INFO] Installing <https://builds.apache.org/job/Bigtop-trunk-test-execution/ws/bigtop-tests/test-execution/common/pom.xml>
to /home/jenkins/.m2/repository/org/apache/bigtop/itest/stacks-common/1.2.0-SNAPSHOT/stacks-common-1.2.0-SNAPSHOT.pom
[INFO] 
[INFO] --- maven-deploy-plugin:2.5:deploy (default-deploy) @ stacks-common ---
Downloading: https://repository.apache.org/content/repositories/snapshots/org/apache/bigtop/itest/stacks-common/1.2.0-SNAPSHOT/maven-metadata.xml
               
[WARNING] Could not transfer metadata org.apache.bigtop.itest:stacks-common:1.2.0-SNAPSHOT/maven-metadata.xml
from/to apache.snapshots.https (https://repository.apache.org/content/repositories/snapshots):
java.lang.RuntimeException: Could not generate DH keypair
[INFO] ------------------------------------------------------------------------
[INFO] Reactor Summary:
[INFO] 
[INFO] stacks-validation-common .......................... FAILURE [6.788s]
[INFO] smoke-tests-conf .................................. SKIPPED
[INFO] packagesmokes ..................................... SKIPPED
[INFO] bigtop-smokes ..................................... SKIPPED
[INFO] ------------------------------------------------------------------------
[INFO] BUILD FAILURE
[INFO] ------------------------------------------------------------------------
[INFO] Total time: 7.797s
[INFO] Finished at: Fri Mar 18 09:52:32 UTC 2016
[INFO] Final Memory: 8M/111M
[INFO] ------------------------------------------------------------------------
[ERROR] Failed to execute goal org.apache.maven.plugins:maven-deploy-plugin:2.5:deploy (default-deploy)
on project stacks-common: Failed to retrieve remote metadata org.apache.bigtop.itest:stacks-common:1.2.0-SNAPSHOT/maven-metadata.xml:
Could not transfer metadata org.apache.bigtop.itest:stacks-common:1.2.0-SNAPSHOT/maven-metadata.xml
from/to apache.snapshots.https (https://repository.apache.org/content/repositories/snapshots):
java.lang.RuntimeException: Could not generate DH keypair: Prime size must be multiple of
64, and can only range from 512 to 1024 (inclusive) -> [Help 1]
[ERROR] 
[ERROR] To see the full stack trace of the errors, re-run Maven with the -e switch.
[ERROR] Re-run Maven using the -X switch to enable full debug logging.
[ERROR] 
[ERROR] For more information about the errors and possible solutions, please read the following
articles:
[ERROR] [Help 1] http://cwiki.apache.org/confluence/display/MAVEN/MojoExecutionException
Build step 'Execute shell' marked build as failure

Mime
View raw message