bigtop-ci mailing list archives

Site index · List index
Message view « Date » · « Thread »
Top « Date » · « Thread »
From Apache Jenkins Server <jenk...@builds.apache.org>
Subject Build failed in Jenkins: Bigtop-trunk-testartifacts #2111
Date Thu, 18 Feb 2016 08:47:26 GMT
See <https://builds.apache.org/job/Bigtop-trunk-testartifacts/2111/changes>

Changes:

[cos] BIGTOP-2296. Provide a way to build Docker container with functional

------------------------------------------
Started by an SCM change
[EnvInject] - Loading node environment variables.
Building remotely on jenkins-ubuntu-1404-4gb-79b (jenkins-cloud-4GB cloud-slave Ubuntu ubuntu)
in workspace <https://builds.apache.org/job/Bigtop-trunk-testartifacts/ws/>
Cloning the remote Git repository
Cloning repository https://git-wip-us.apache.org/repos/asf/bigtop.git
 > git init <https://builds.apache.org/job/Bigtop-trunk-testartifacts/ws/> # timeout=10
Fetching upstream changes from https://git-wip-us.apache.org/repos/asf/bigtop.git
 > git --version # timeout=10
 > git -c core.askpass=true fetch --tags --progress https://git-wip-us.apache.org/repos/asf/bigtop.git
+refs/heads/*:refs/remotes/origin/*
 > git config remote.origin.url https://git-wip-us.apache.org/repos/asf/bigtop.git # timeout=10
 > git config --add remote.origin.fetch +refs/heads/*:refs/remotes/origin/* # timeout=10
 > git config remote.origin.url https://git-wip-us.apache.org/repos/asf/bigtop.git # timeout=10
Fetching upstream changes from https://git-wip-us.apache.org/repos/asf/bigtop.git
 > git -c core.askpass=true fetch --tags --progress https://git-wip-us.apache.org/repos/asf/bigtop.git
+refs/heads/*:refs/remotes/origin/*
 > git rev-parse origin/master^{commit} # timeout=10
Checking out Revision ae9e1634076e2419bbb943ec7ec0edfc8ed81de4 (origin/master)
 > git config core.sparsecheckout # timeout=10
 > git checkout -f ae9e1634076e2419bbb943ec7ec0edfc8ed81de4
 > git rev-list 0e3c72192e4f3648cfd85b13941656545062d314 # timeout=10
Parsing POMs
Modules changed, recalculating dependency graph
Established TCP socket on 48895
maven3-agent.jar already up to date
maven3-interceptor.jar already up to date
maven3-interceptor-commons.jar already up to date
[test-artifacts] $ /home/jenkins/tools/java/latest1.6/bin/java -Xmx2g -Xms256m -XX:MaxPermSize=512m
-cp /jenkins/maven3-agent.jar:/home/jenkins/tools/maven/apache-maven-3.0.4/boot/plexus-classworlds-2.4.jar
org.jvnet.hudson.maven3.agent.Maven3Main /home/jenkins/tools/maven/apache-maven-3.0.4 /jenkins/slave.jar
/jenkins/maven3-interceptor.jar /jenkins/maven3-interceptor-commons.jar 48895
<===[JENKINS REMOTING CAPACITY]===>   channel started
Executing Maven:  -B -f <https://builds.apache.org/job/Bigtop-trunk-testartifacts/ws/bigtop-tests/test-artifacts/pom.xml>
-Dmaven.repo.local=/jenkins/maven-repositories/0 -U clean deploy
[INFO] Scanning for projects...
Downloading: http://repo.maven.apache.org/maven2/org/apache/maven/wagon/wagon-ssh-external/2.6/wagon-ssh-external-2.6.pom
Downloaded: http://repo.maven.apache.org/maven2/org/apache/maven/wagon/wagon-ssh-external/2.6/wagon-ssh-external-2.6.pom
(5 KB at 33.2 KB/sec)
Downloading: http://repo.maven.apache.org/maven2/org/apache/maven/wagon/wagon-ssh-common/2.6/wagon-ssh-common-2.6.pom
Downloaded: http://repo.maven.apache.org/maven2/org/apache/maven/wagon/wagon-ssh-common/2.6/wagon-ssh-common-2.6.pom
(2 KB at 149.5 KB/sec)
Downloading: http://repo.maven.apache.org/maven2/org/codehaus/plexus/plexus-interactivity-api/1.0-alpha-6/plexus-interactivity-api-1.0-alpha-6.pom
Downloaded: http://repo.maven.apache.org/maven2/org/codehaus/plexus/plexus-interactivity-api/1.0-alpha-6/plexus-interactivity-api-1.0-alpha-6.pom
(726 B at 44.3 KB/sec)
Downloading: http://repo.maven.apache.org/maven2/org/codehaus/plexus/plexus-interactivity/1.0-alpha-6/plexus-interactivity-1.0-alpha-6.pom
Downloaded: http://repo.maven.apache.org/maven2/org/codehaus/plexus/plexus-interactivity/1.0-alpha-6/plexus-interactivity-1.0-alpha-6.pom
(2 KB at 116.4 KB/sec)
Downloading: http://repo.maven.apache.org/maven2/org/codehaus/plexus/plexus-components/1.1.9/plexus-components-1.1.9.pom
Downloaded: http://repo.maven.apache.org/maven2/org/codehaus/plexus/plexus-components/1.1.9/plexus-components-1.1.9.pom
(3 KB at 237.1 KB/sec)
Downloading: http://repo.maven.apache.org/maven2/org/apache/maven/wagon/wagon-ssh-external/2.6/wagon-ssh-external-2.6.jar
Downloading: http://repo.maven.apache.org/maven2/org/apache/maven/wagon/wagon-ssh-common/2.6/wagon-ssh-common-2.6.jar
Downloading: http://repo.maven.apache.org/maven2/org/codehaus/plexus/plexus-interactivity-api/1.0-alpha-6/plexus-interactivity-api-1.0-alpha-6.jar
Downloaded: http://repo.maven.apache.org/maven2/org/apache/maven/wagon/wagon-ssh-external/2.6/wagon-ssh-external-2.6.jar
(15 KB at 806.4 KB/sec)
Downloaded: http://repo.maven.apache.org/maven2/org/codehaus/plexus/plexus-interactivity-api/1.0-alpha-6/plexus-interactivity-api-1.0-alpha-6.jar
(12 KB at 500.6 KB/sec)
Downloaded: http://repo.maven.apache.org/maven2/org/apache/maven/wagon/wagon-ssh-common/2.6/wagon-ssh-common-2.6.jar
(25 KB at 774.8 KB/sec)
Downloading: http://repo.maven.apache.org/maven2/org/codehaus/groovy/groovy-eclipse-compiler/2.8.0-01/groovy-eclipse-compiler-2.8.0-01.pom
Downloaded: http://repo.maven.apache.org/maven2/org/codehaus/groovy/groovy-eclipse-compiler/2.8.0-01/groovy-eclipse-compiler-2.8.0-01.pom
(4 KB at 298.1 KB/sec)
Downloading: http://repo.maven.apache.org/maven2/org/codehaus/codehaus-parent/4/codehaus-parent-4.pom
Downloaded: http://repo.maven.apache.org/maven2/org/codehaus/codehaus-parent/4/codehaus-parent-4.pom
(5 KB at 470.8 KB/sec)
Downloading: http://nexus.codehaus.org/snapshots/org/codehaus/groovy/groovy-eclipse-batch/maven-metadata.xml
Downloading: http://repo.maven.apache.org/maven2/org/codehaus/groovy/groovy-eclipse-batch/maven-metadata.xml
Downloading: http://repository.codehaus.org/org/codehaus/groovy/groovy-eclipse-batch/maven-metadata.xml
Downloaded: http://repo.maven.apache.org/maven2/org/codehaus/groovy/groovy-eclipse-batch/maven-metadata.xml
(2 KB at 140.2 KB/sec)
[WARNING] Could not transfer metadata org.codehaus.groovy:groovy-eclipse-batch/maven-metadata.xml
from/to codehaus.org (http://repository.codehaus.org): repository.codehaus.org
[WARNING] Could not transfer metadata org.codehaus.groovy:groovy-eclipse-batch/maven-metadata.xml
from/to codehaus-snapshots (http://nexus.codehaus.org/snapshots/): nexus.codehaus.org
Downloading: http://repo.maven.apache.org/maven2/org/codehaus/groovy/groovy-eclipse-batch/1.8.4-01/groovy-eclipse-batch-1.8.4-01.pom
Downloaded: http://repo.maven.apache.org/maven2/org/codehaus/groovy/groovy-eclipse-batch/1.8.4-01/groovy-eclipse-batch-1.8.4-01.pom
(2 KB at 176.6 KB/sec)
Downloading: http://repo.maven.apache.org/maven2/org/codehaus/groovy/groovy-eclipse-batch/1.8.6-01/groovy-eclipse-batch-1.8.6-01.pom
Downloaded: http://repo.maven.apache.org/maven2/org/codehaus/groovy/groovy-eclipse-batch/1.8.6-01/groovy-eclipse-batch-1.8.6-01.pom
(2 KB at 176.6 KB/sec)
Downloading: http://repo.maven.apache.org/maven2/org/codehaus/groovy/groovy-eclipse-batch/2.0.0-01/groovy-eclipse-batch-2.0.0-01.pom
Downloaded: http://repo.maven.apache.org/maven2/org/codehaus/groovy/groovy-eclipse-batch/2.0.0-01/groovy-eclipse-batch-2.0.0-01.pom
(2 KB at 160.5 KB/sec)
Downloading: http://repo.maven.apache.org/maven2/org/codehaus/groovy/groovy-eclipse-batch/2.0.4-01/groovy-eclipse-batch-2.0.4-01.pom
Downloaded: http://repo.maven.apache.org/maven2/org/codehaus/groovy/groovy-eclipse-batch/2.0.4-01/groovy-eclipse-batch-2.0.4-01.pom
(2 KB at 175.7 KB/sec)
Downloading: http://repo.maven.apache.org/maven2/org/codehaus/groovy/groovy-eclipse-batch/2.0.4-02/groovy-eclipse-batch-2.0.4-02.pom
Downloaded: http://repo.maven.apache.org/maven2/org/codehaus/groovy/groovy-eclipse-batch/2.0.4-02/groovy-eclipse-batch-2.0.4-02.pom
(2 KB at 195.2 KB/sec)
Downloading: http://repo.maven.apache.org/maven2/org/codehaus/groovy/groovy-eclipse-batch/2.0.4-03/groovy-eclipse-batch-2.0.4-03.pom
Downloaded: http://repo.maven.apache.org/maven2/org/codehaus/groovy/groovy-eclipse-batch/2.0.4-03/groovy-eclipse-batch-2.0.4-03.pom
(2 KB at 195.2 KB/sec)
Downloading: http://repo.maven.apache.org/maven2/org/codehaus/groovy/groovy-eclipse-batch/2.0.4-04/groovy-eclipse-batch-2.0.4-04.pom
Downloaded: http://repo.maven.apache.org/maven2/org/codehaus/groovy/groovy-eclipse-batch/2.0.4-04/groovy-eclipse-batch-2.0.4-04.pom
(2 KB at 175.7 KB/sec)
Downloading: http://repo.maven.apache.org/maven2/org/codehaus/groovy/groovy-eclipse-batch/2.0.6-01/groovy-eclipse-batch-2.0.6-01.pom
Downloaded: http://repo.maven.apache.org/maven2/org/codehaus/groovy/groovy-eclipse-batch/2.0.6-01/groovy-eclipse-batch-2.0.6-01.pom
(2 KB at 175.7 KB/sec)
Downloading: http://repo.maven.apache.org/maven2/org/codehaus/groovy/groovy-eclipse-batch/2.0.7-01/groovy-eclipse-batch-2.0.7-01.pom
Downloaded: http://repo.maven.apache.org/maven2/org/codehaus/groovy/groovy-eclipse-batch/2.0.7-01/groovy-eclipse-batch-2.0.7-01.pom
(2 KB at 175.7 KB/sec)
Downloading: http://repo.maven.apache.org/maven2/org/codehaus/groovy/groovy-eclipse-batch/2.0.7-02/groovy-eclipse-batch-2.0.7-02.pom
Downloaded: http://repo.maven.apache.org/maven2/org/codehaus/groovy/groovy-eclipse-batch/2.0.7-02/groovy-eclipse-batch-2.0.7-02.pom
(2 KB at 195.2 KB/sec)
Downloading: http://repo.maven.apache.org/maven2/org/codehaus/groovy/groovy-eclipse-batch/2.0.7-03/groovy-eclipse-batch-2.0.7-03.pom
Downloaded: http://repo.maven.apache.org/maven2/org/codehaus/groovy/groovy-eclipse-batch/2.0.7-03/groovy-eclipse-batch-2.0.7-03.pom
(2 KB at 159.7 KB/sec)
Downloading: http://repo.maven.apache.org/maven2/org/codehaus/groovy/groovy-eclipse-batch/2.1.1-01/groovy-eclipse-batch-2.1.1-01.pom
Downloaded: http://repo.maven.apache.org/maven2/org/codehaus/groovy/groovy-eclipse-batch/2.1.1-01/groovy-eclipse-batch-2.1.1-01.pom
(2 KB at 195.2 KB/sec)
Downloading: http://repo.maven.apache.org/maven2/org/codehaus/groovy/groovy-eclipse-batch/2.1.3-01/groovy-eclipse-batch-2.1.3-01.pom
Downloaded: http://repo.maven.apache.org/maven2/org/codehaus/groovy/groovy-eclipse-batch/2.1.3-01/groovy-eclipse-batch-2.1.3-01.pom
(2 KB at 175.7 KB/sec)
Downloading: http://repo.maven.apache.org/maven2/org/codehaus/groovy/groovy-eclipse-batch/2.1.5-01/groovy-eclipse-batch-2.1.5-01.pom
Downloaded: http://repo.maven.apache.org/maven2/org/codehaus/groovy/groovy-eclipse-batch/2.1.5-01/groovy-eclipse-batch-2.1.5-01.pom
(2 KB at 195.2 KB/sec)
Downloading: http://repo.maven.apache.org/maven2/org/codehaus/groovy/groovy-eclipse-batch/2.1.5-02/groovy-eclipse-batch-2.1.5-02.pom
Downloaded: http://repo.maven.apache.org/maven2/org/codehaus/groovy/groovy-eclipse-batch/2.1.5-02/groovy-eclipse-batch-2.1.5-02.pom
(2 KB at 159.7 KB/sec)
Downloading: http://repo.maven.apache.org/maven2/org/codehaus/groovy/groovy-eclipse-batch/2.1.5-03/groovy-eclipse-batch-2.1.5-03.pom
Downloaded: http://repo.maven.apache.org/maven2/org/codehaus/groovy/groovy-eclipse-batch/2.1.5-03/groovy-eclipse-batch-2.1.5-03.pom
(2 KB at 195.2 KB/sec)
Downloading: http://repo.maven.apache.org/maven2/org/codehaus/groovy/groovy-eclipse-batch/2.1.8-01/groovy-eclipse-batch-2.1.8-01.pom
Downloaded: http://repo.maven.apache.org/maven2/org/codehaus/groovy/groovy-eclipse-batch/2.1.8-01/groovy-eclipse-batch-2.1.8-01.pom
(2 KB at 58.2 KB/sec)
Downloading: http://repo.maven.apache.org/maven2/org/codehaus/groovy/groovy-eclipse-batch/2.3.4-01/groovy-eclipse-batch-2.3.4-01.pom
Downloaded: http://repo.maven.apache.org/maven2/org/codehaus/groovy/groovy-eclipse-batch/2.3.4-01/groovy-eclipse-batch-2.3.4-01.pom
(2 KB at 213.3 KB/sec)
Downloading: http://repo.maven.apache.org/maven2/org/codehaus/groovy/groovy-eclipse-batch/2.3.7-01/groovy-eclipse-batch-2.3.7-01.pom
Downloaded: http://repo.maven.apache.org/maven2/org/codehaus/groovy/groovy-eclipse-batch/2.3.7-01/groovy-eclipse-batch-2.3.7-01.pom
(2 KB at 246.9 KB/sec)
Downloading: http://repo.maven.apache.org/maven2/org/codehaus/groovy/groovy-eclipse-batch/2.4.3-01/groovy-eclipse-batch-2.4.3-01.pom
Downloaded: http://repo.maven.apache.org/maven2/org/codehaus/groovy/groovy-eclipse-batch/2.4.3-01/groovy-eclipse-batch-2.4.3-01.pom
(2 KB at 213.3 KB/sec)
Downloading: http://repo.maven.apache.org/maven2/org/codehaus/plexus/plexus-container-default/1.5.4/plexus-container-default-1.5.4.pom
Downloaded: http://repo.maven.apache.org/maven2/org/codehaus/plexus/plexus-container-default/1.5.4/plexus-container-default-1.5.4.pom
(3 KB at 269.0 KB/sec)
Downloading: http://repo.maven.apache.org/maven2/org/codehaus/plexus/plexus-containers/1.5.4/plexus-containers-1.5.4.pom
Downloaded: http://repo.maven.apache.org/maven2/org/codehaus/plexus/plexus-containers/1.5.4/plexus-containers-1.5.4.pom
(5 KB at 460.1 KB/sec)
Downloading: http://repo.maven.apache.org/maven2/org/codehaus/groovy/groovy-eclipse-compiler/2.8.0-01/groovy-eclipse-compiler-2.8.0-01.jar
Downloading: http://repo.maven.apache.org/maven2/org/codehaus/groovy/groovy-eclipse-batch/2.4.3-01/groovy-eclipse-batch-2.4.3-01.jar
Downloaded: http://repo.maven.apache.org/maven2/org/codehaus/groovy/groovy-eclipse-compiler/2.8.0-01/groovy-eclipse-compiler-2.8.0-01.jar
(19 KB at 1319.3 KB/sec)
Downloaded: http://repo.maven.apache.org/maven2/org/codehaus/groovy/groovy-eclipse-batch/2.4.3-01/groovy-eclipse-batch-2.4.3-01.jar
(15062 KB at 31055.5 KB/sec)
[INFO] ------------------------------------------------------------------------
[INFO] Reactor Build Order:
[INFO] 
[INFO] bigtop-smokes
[INFO] hadoopsmoke
[INFO] packagesmoke
[INFO] httpfssmokes
[INFO] ooziesmoke
[INFO] hbasesmoke
[INFO] flumesmoke
[INFO] sqoopsmokes
[INFO] mahoutsmoke
[INFO] giraphsmoke
[INFO] huesmoke
[INFO] solrsmoke
[INFO] crunchsmoke
[INFO] datafusmoke
[INFO] io-longevity
[INFO] hcatalogsmoke
[INFO] sparksmoke
[INFO] phoenixsmoke
[INFO] fatjar
[INFO]                                                                         
[INFO] ------------------------------------------------------------------------
[INFO] Building bigtop-smokes 1.2.0-SNAPSHOT
[INFO] ------------------------------------------------------------------------
Downloading: http://repo.maven.apache.org/maven2/org/apache/maven/plugins/maven-remote-resources-plugin/1.1/maven-remote-resources-plugin-1.1.pom
Downloaded: http://repo.maven.apache.org/maven2/org/apache/maven/plugins/maven-remote-resources-plugin/1.1/maven-remote-resources-plugin-1.1.pom
(12 KB at 1002.3 KB/sec)
Downloading: http://repo.maven.apache.org/maven2/org/apache/maven/plugins/maven-plugins/14/maven-plugins-14.pom
Downloaded: http://repo.maven.apache.org/maven2/org/apache/maven/plugins/maven-plugins/14/maven-plugins-14.pom
(13 KB at 680.2 KB/sec)
Downloading: http://repo.maven.apache.org/maven2/org/apache/maven/plugins/maven-remote-resources-plugin/1.1/maven-remote-resources-plugin-1.1.jar
Downloaded: http://repo.maven.apache.org/maven2/org/apache/maven/plugins/maven-remote-resources-plugin/1.1/maven-remote-resources-plugin-1.1.jar
(61 KB at 4662.3 KB/sec)
Downloading: http://repo.maven.apache.org/maven2/org/apache/maven/plugins/maven-failsafe-plugin/2.7.1/maven-failsafe-plugin-2.7.1.pom
Downloaded: http://repo.maven.apache.org/maven2/org/apache/maven/plugins/maven-failsafe-plugin/2.7.1/maven-failsafe-plugin-2.7.1.pom
(12 KB at 1273.1 KB/sec)
Downloading: http://repo.maven.apache.org/maven2/org/apache/maven/surefire/surefire/2.7.1/surefire-2.7.1.pom
Downloaded: http://repo.maven.apache.org/maven2/org/apache/maven/surefire/surefire/2.7.1/surefire-2.7.1.pom
(10 KB at 1003.0 KB/sec)
Downloading: http://repo.maven.apache.org/maven2/org/apache/maven/maven-parent/18/maven-parent-18.pom
Downloaded: http://repo.maven.apache.org/maven2/org/apache/maven/maven-parent/18/maven-parent-18.pom
(24 KB at 2354.5 KB/sec)
Downloading: http://repo.maven.apache.org/maven2/org/apache/maven/plugins/maven-failsafe-plugin/2.7.1/maven-failsafe-plugin-2.7.1.jar
Downloaded: http://repo.maven.apache.org/maven2/org/apache/maven/plugins/maven-failsafe-plugin/2.7.1/maven-failsafe-plugin-2.7.1.jar
(45 KB at 4980.6 KB/sec)
Downloading: http://repo.maven.apache.org/maven2/org/apache/maven/plugins/maven-clean-plugin/2.4.1/maven-clean-plugin-2.4.1.pom
Downloaded: http://repo.maven.apache.org/maven2/org/apache/maven/plugins/maven-clean-plugin/2.4.1/maven-clean-plugin-2.4.1.pom
(5 KB at 451.1 KB/sec)
Downloading: http://repo.maven.apache.org/maven2/org/apache/maven/plugins/maven-clean-plugin/2.4.1/maven-clean-plugin-2.4.1.jar
Downloaded: http://repo.maven.apache.org/maven2/org/apache/maven/plugins/maven-clean-plugin/2.4.1/maven-clean-plugin-2.4.1.jar
(23 KB at 2555.2 KB/sec)
Downloading: http://repo.maven.apache.org/maven2/org/apache/maven/plugins/maven-install-plugin/2.3/maven-install-plugin-2.3.pom
Downloaded: http://repo.maven.apache.org/maven2/org/apache/maven/plugins/maven-install-plugin/2.3/maven-install-plugin-2.3.pom
(5 KB at 544.4 KB/sec)
Downloading: http://repo.maven.apache.org/maven2/org/apache/maven/plugins/maven-plugins/13/maven-plugins-13.pom
Downloaded: http://repo.maven.apache.org/maven2/org/apache/maven/plugins/maven-plugins/13/maven-plugins-13.pom
(12 KB at 1438.6 KB/sec)
Downloading: http://repo.maven.apache.org/maven2/org/apache/maven/plugins/maven-install-plugin/2.3/maven-install-plugin-2.3.jar
Downloaded: http://repo.maven.apache.org/maven2/org/apache/maven/plugins/maven-install-plugin/2.3/maven-install-plugin-2.3.jar
(23 KB at 2466.7 KB/sec)
Downloading: http://repo.maven.apache.org/maven2/org/apache/maven/plugins/maven-deploy-plugin/2.5/maven-deploy-plugin-2.5.pom
Downloaded: http://repo.maven.apache.org/maven2/org/apache/maven/plugins/maven-deploy-plugin/2.5/maven-deploy-plugin-2.5.pom
(6 KB at 619.2 KB/sec)
Downloading: http://repo.maven.apache.org/maven2/org/apache/maven/plugins/maven-plugins/16/maven-plugins-16.pom
Downloaded: http://repo.maven.apache.org/maven2/org/apache/maven/plugins/maven-plugins/16/maven-plugins-16.pom
(13 KB at 1580.7 KB/sec)
Downloading: http://repo.maven.apache.org/maven2/org/apache/maven/plugins/maven-deploy-plugin/2.5/maven-deploy-plugin-2.5.jar
Downloaded: http://repo.maven.apache.org/maven2/org/apache/maven/plugins/maven-deploy-plugin/2.5/maven-deploy-plugin-2.5.jar
(23 KB at 2505.4 KB/sec)
Downloading: http://repository.apache.org/snapshots/org/apache/bigtop/itest/itest-common/1.2.0-SNAPSHOT/maven-metadata.xml
Downloading: http://repository.apache.org/snapshots/org/apache/bigtop/itest/itest-common/1.2.0-SNAPSHOT/itest-common-1.2.0-SNAPSHOT.pom
[WARNING] The POM for org.apache.bigtop.itest:itest-common:jar:1.2.0-SNAPSHOT is missing,
no dependency information available
Downloading: http://repository.apache.org/snapshots/org/apache/bigtop/itest/itest-common/1.2.0-SNAPSHOT/itest-common-1.2.0-SNAPSHOT.jar
[INFO] ------------------------------------------------------------------------
[INFO] Reactor Summary:
[INFO] 
[INFO] bigtop-smokes ..................................... FAILURE [2.136s]
[INFO] hadoopsmoke ....................................... SKIPPED
[INFO] packagesmoke ...................................... SKIPPED
[INFO] httpfssmokes ...................................... SKIPPED
[INFO] ooziesmoke ........................................ SKIPPED
[INFO] hbasesmoke ........................................ SKIPPED
[INFO] flumesmoke ........................................ SKIPPED
[INFO] sqoopsmokes ....................................... SKIPPED
[INFO] mahoutsmoke ....................................... SKIPPED
[INFO] giraphsmoke ....................................... SKIPPED
[INFO] huesmoke .......................................... SKIPPED
[INFO] solrsmoke ......................................... SKIPPED
[INFO] crunchsmoke ....................................... SKIPPED
[INFO] datafusmoke ....................................... SKIPPED
[INFO] io-longevity ...................................... SKIPPED
[INFO] hcatalogsmoke ..................................... SKIPPED
[INFO] sparksmoke ........................................ SKIPPED
[INFO] phoenixsmoke ...................................... SKIPPED
[INFO] fatjar ............................................ SKIPPED
[INFO] ------------------------------------------------------------------------
[INFO] BUILD FAILURE
[INFO] ------------------------------------------------------------------------
[INFO] Total time: 10.158s
[INFO] Finished at: Thu Feb 18 08:47:12 UTC 2016
[INFO] Final Memory: 10M/245M
[INFO] ------------------------------------------------------------------------
Waiting for Jenkins to finish collecting data
[ERROR] Failed to execute goal on project bigtop-smokes: Could not resolve dependencies for
project org.apache.bigtop.itest:bigtop-smokes:pom:1.2.0-SNAPSHOT: Could not find artifact
org.apache.bigtop.itest:itest-common:jar:1.2.0-SNAPSHOT in Nexus (http://repository.apache.org/snapshots)
-> [Help 1]
[ERROR] 
[ERROR] To see the full stack trace of the errors, re-run Maven with the -e switch.
[ERROR] Re-run Maven using the -X switch to enable full debug logging.
[ERROR] 
[ERROR] For more information about the errors and possible solutions, please read the following
articles:
[ERROR] [Help 1] http://cwiki.apache.org/confluence/display/MAVEN/DependencyResolutionException
[JENKINS] Archiving <https://builds.apache.org/job/Bigtop-trunk-testartifacts/ws/bigtop-tests/test-artifacts/pom.xml>
to org.apache.bigtop.itest/bigtop-smokes/1.2.0-SNAPSHOT/bigtop-smokes-1.2.0-SNAPSHOT.pom
[JENKINS] Archiving <https://builds.apache.org/job/Bigtop-trunk-testartifacts/ws/bigtop-tests/test-artifacts/sqoop/pom.xml>
to org.apache.bigtop.itest/sqoop-smoke/1.2.0-SNAPSHOT/sqoop-smoke-1.2.0-SNAPSHOT.pom
[JENKINS] Archiving <https://builds.apache.org/job/Bigtop-trunk-testartifacts/ws/bigtop-tests/test-artifacts/hue/pom.xml>
to org.apache.bigtop.itest/hue-smoke/1.2.0-SNAPSHOT/hue-smoke-1.2.0-SNAPSHOT.pom
[JENKINS] Archiving <https://builds.apache.org/job/Bigtop-trunk-testartifacts/ws/bigtop-tests/test-artifacts/crunch/pom.xml>
to org.apache.bigtop.itest/crunch-smoke/1.2.0-SNAPSHOT/crunch-smoke-1.2.0-SNAPSHOT.pom
[JENKINS] Archiving <https://builds.apache.org/job/Bigtop-trunk-testartifacts/ws/bigtop-tests/test-artifacts/package/pom.xml>
to org.apache.bigtop.itest/package-smoke/1.2.0-SNAPSHOT/package-smoke-1.2.0-SNAPSHOT.pom
[JENKINS] Archiving <https://builds.apache.org/job/Bigtop-trunk-testartifacts/ws/bigtop-tests/test-artifacts/flume/pom.xml>
to org.apache.bigtop.itest/flume-smoke/1.2.0-SNAPSHOT/flume-smoke-1.2.0-SNAPSHOT.pom
[JENKINS] Archiving <https://builds.apache.org/job/Bigtop-trunk-testartifacts/ws/bigtop-tests/test-artifacts/httpfs/pom.xml>
to org.apache.bigtop.itest/httpfs-smoke/1.2.0-SNAPSHOT/httpfs-smoke-1.2.0-SNAPSHOT.pom
[JENKINS] Archiving <https://builds.apache.org/job/Bigtop-trunk-testartifacts/ws/bigtop-tests/test-artifacts/spark/pom.xml>
to org.apache.bigtop.itest/spark-smoke/1.2.0-SNAPSHOT/spark-smoke-1.2.0-SNAPSHOT.pom
[JENKINS] Archiving <https://builds.apache.org/job/Bigtop-trunk-testartifacts/ws/bigtop-tests/test-artifacts/hadoop/pom.xml>
to org.apache.bigtop.itest/hadoop-smoke/1.2.0-SNAPSHOT/hadoop-smoke-1.2.0-SNAPSHOT.pom
[JENKINS] Archiving <https://builds.apache.org/job/Bigtop-trunk-testartifacts/ws/bigtop-tests/test-artifacts/oozie/pom.xml>
to org.apache.bigtop.itest/oozie-smoke/1.2.0-SNAPSHOT/oozie-smoke-1.2.0-SNAPSHOT.pom
[JENKINS] Archiving <https://builds.apache.org/job/Bigtop-trunk-testartifacts/ws/bigtop-tests/test-artifacts/giraph/pom.xml>
to org.apache.bigtop.itest/giraph-smoke/1.2.0-SNAPSHOT/giraph-smoke-1.2.0-SNAPSHOT.pom
[JENKINS] Archiving <https://builds.apache.org/job/Bigtop-trunk-testartifacts/ws/bigtop-tests/test-artifacts/hcatalog/pom.xml>
to org.apache.bigtop.itest/hcatalog-smoke/1.2.0-SNAPSHOT/hcatalog-smoke-1.2.0-SNAPSHOT.pom
[JENKINS] Archiving <https://builds.apache.org/job/Bigtop-trunk-testartifacts/ws/bigtop-tests/test-artifacts/datafu/pom.xml>
to org.apache.bigtop.itest/datafu-smoke/1.2.0-SNAPSHOT/datafu-smoke-1.2.0-SNAPSHOT.pom
[JENKINS] Archiving <https://builds.apache.org/job/Bigtop-trunk-testartifacts/ws/bigtop-tests/test-artifacts/longevity/pom.xml>
to org.apache.bigtop.itest/io-longevity/1.2.0-SNAPSHOT/io-longevity-1.2.0-SNAPSHOT.pom
[JENKINS] Archiving <https://builds.apache.org/job/Bigtop-trunk-testartifacts/ws/bigtop-tests/test-artifacts/mahout/pom.xml>
to org.apache.bigtop.itest/mahout-smoke/1.2.0-SNAPSHOT/mahout-smoke-1.2.0-SNAPSHOT.pom
[JENKINS] Archiving <https://builds.apache.org/job/Bigtop-trunk-testartifacts/ws/bigtop-tests/test-artifacts/hbase/pom.xml>
to org.apache.bigtop.itest/hbase-smoke/1.2.0-SNAPSHOT/hbase-smoke-1.2.0-SNAPSHOT.pom
[JENKINS] Archiving <https://builds.apache.org/job/Bigtop-trunk-testartifacts/ws/bigtop-tests/test-artifacts/solr/pom.xml>
to org.apache.bigtop.itest/solr-smoke/1.2.0-SNAPSHOT/solr-smoke-1.2.0-SNAPSHOT.pom
[JENKINS] Archiving <https://builds.apache.org/job/Bigtop-trunk-testartifacts/ws/bigtop-tests/test-artifacts/phoenix/pom.xml>
to org.apache.bigtop.itest/phoenix-smoke/1.2.0-SNAPSHOT/phoenix-smoke-1.2.0-SNAPSHOT.pom
[JENKINS] Archiving <https://builds.apache.org/job/Bigtop-trunk-testartifacts/ws/bigtop-tests/test-artifacts/fatjar/pom.xml>
to org.apache.bigtop.itest/fat-smoke/1.2.0-SNAPSHOT/fat-smoke-1.2.0-SNAPSHOT.pom
Sending e-mails to: ci@bigtop.apache.org
channel stopped

Mime
View raw message