bigtop-ci mailing list archives

Site index · List index
Message view « Date » · « Thread »
Top « Date » · « Thread »
From Apache Jenkins Server <jenk...@builds.apache.org>
Subject Build failed in Jenkins: Bigtop-trunk-test-execution #1829
Date Fri, 26 Feb 2016 02:16:37 GMT
See <https://builds.apache.org/job/Bigtop-trunk-test-execution/1829/changes>

Changes:

[ywkim] BIGTOP-2220 : flume-agent.init incorrectly handles flume.conf

------------------------------------------
[...truncated 2100 lines...]
5450/6230 KB   
5454/6230 KB   
5458/6230 KB   
5462/6230 KB   
5466/6230 KB   
5470/6230 KB   
5474/6230 KB   
5478/6230 KB   
5482/6230 KB   
5486/6230 KB   
5490/6230 KB   
5494/6230 KB   
5498/6230 KB   
5502/6230 KB   
5506/6230 KB   
5510/6230 KB   
5514/6230 KB   
5518/6230 KB   
5522/6230 KB   
5526/6230 KB   
5530/6230 KB   
5534/6230 KB   
5538/6230 KB   
5542/6230 KB   
5546/6230 KB   
5550/6230 KB   
5554/6230 KB   
5558/6230 KB   
5561/6230 KB   
5565/6230 KB   
5569/6230 KB   
5573/6230 KB   
5574/6230 KB   
5578/6230 KB   
5582/6230 KB   
5586/6230 KB   
5590/6230 KB   
5594/6230 KB   
5598/6230 KB   
5602/6230 KB   
5606/6230 KB   
5610/6230 KB   
5614/6230 KB   
5618/6230 KB   
5622/6230 KB   
5626/6230 KB   
5630/6230 KB   
5634/6230 KB   
5638/6230 KB   
5642/6230 KB   
5646/6230 KB   
5650/6230 KB   
5654/6230 KB   
5658/6230 KB   
5662/6230 KB   
5666/6230 KB   
5670/6230 KB   
5674/6230 KB   
5678/6230 KB   
5682/6230 KB   
5686/6230 KB   
5690/6230 KB   
5694/6230 KB   
5698/6230 KB   
5702/6230 KB   
5706/6230 KB   
5710/6230 KB   
5714/6230 KB   
5718/6230 KB   
5722/6230 KB   
5726/6230 KB   
5730/6230 KB   
5734/6230 KB   
5738/6230 KB   
5742/6230 KB   
5746/6230 KB   
5750/6230 KB   
5754/6230 KB   
5758/6230 KB   
5762/6230 KB   
5766/6230 KB   
5770/6230 KB   
5772/6230 KB   
5776/6230 KB   
5780/6230 KB   
5784/6230 KB   
5786/6230 KB   
5790/6230 KB   
5794/6230 KB   
5798/6230 KB   
5800/6230 KB   
5804/6230 KB   
5808/6230 KB   
5812/6230 KB   
5816/6230 KB   
5820/6230 KB   
5824/6230 KB   
5828/6230 KB   
5832/6230 KB   
5836/6230 KB   
5840/6230 KB   
5844/6230 KB   
5848/6230 KB   
5852/6230 KB   
5856/6230 KB   
5860/6230 KB   
5864/6230 KB   
5868/6230 KB   
5872/6230 KB   
5876/6230 KB   
5880/6230 KB   
5884/6230 KB   
5888/6230 KB   
5892/6230 KB   
5896/6230 KB   
5900/6230 KB   
5904/6230 KB   
5908/6230 KB   
5912/6230 KB   
5916/6230 KB   
5920/6230 KB   
5924/6230 KB   
5928/6230 KB   
5932/6230 KB   
5936/6230 KB   
5940/6230 KB   
5944/6230 KB   
5948/6230 KB   
5952/6230 KB   
5956/6230 KB   
5960/6230 KB   
5964/6230 KB   
5968/6230 KB   
5972/6230 KB   
5976/6230 KB   
5980/6230 KB   
5984/6230 KB   
5988/6230 KB   
5992/6230 KB   
5996/6230 KB   
5998/6230 KB   
6002/6230 KB   
6006/6230 KB   
6010/6230 KB   
6012/6230 KB   
6016/6230 KB   
6020/6230 KB   
6024/6230 KB   
6028/6230 KB   
6032/6230 KB   
6036/6230 KB   
6040/6230 KB   
6044/6230 KB   
6048/6230 KB   
6052/6230 KB   
6056/6230 KB   
6060/6230 KB   
6064/6230 KB   
6068/6230 KB   
6072/6230 KB   
6076/6230 KB   
6080/6230 KB   
6084/6230 KB   
6088/6230 KB   
6092/6230 KB   
6096/6230 KB   
6100/6230 KB   
6104/6230 KB   
6108/6230 KB   
6112/6230 KB   
6116/6230 KB   
6120/6230 KB   
6124/6230 KB   
6128/6230 KB   
6132/6230 KB   
6136/6230 KB   
6140/6230 KB   
6144/6230 KB   
6148/6230 KB   
6152/6230 KB   
6156/6230 KB   
6160/6230 KB   
6164/6230 KB   
6168/6230 KB   
6172/6230 KB   
6176/6230 KB   
6180/6230 KB   
6184/6230 KB   
6188/6230 KB   
6192/6230 KB   
6196/6230 KB   
6200/6230 KB   
6204/6230 KB   
6208/6230 KB   
6210/6230 KB   
6214/6230 KB   
6218/6230 KB   
6222/6230 KB   
6224/6230 KB   
6228/6230 KB   
6230/6230 KB   
               
Downloaded: http://repo.maven.apache.org/maven2/org/codehaus/groovy/groovy-all/2.1.8/groovy-all-2.1.8.jar
(6230 KB at 14030.6 KB/sec)
[INFO] 
[INFO] --- maven-install-plugin:2.3:install (default-install) @ stacks-common ---
Downloading: http://repo.maven.apache.org/maven2/org/codehaus/plexus/plexus-digest/1.0/plexus-digest-1.0.pom
2/2 KB         
         
Downloaded: http://repo.maven.apache.org/maven2/org/codehaus/plexus/plexus-digest/1.0/plexus-digest-1.0.pom
(2 KB at 30.4 KB/sec)
Downloading: http://repo.maven.apache.org/maven2/org/codehaus/plexus/plexus-components/1.1.7/plexus-components-1.1.7.pom
4/5 KB   
5/5 KB   
         
Downloaded: http://repo.maven.apache.org/maven2/org/codehaus/plexus/plexus-components/1.1.7/plexus-components-1.1.7.pom
(5 KB at 142.9 KB/sec)
Downloading: http://repo.maven.apache.org/maven2/org/codehaus/plexus/plexus-digest/1.0/plexus-digest-1.0.jar
4/12 KB   
8/12 KB   
12/12 KB   
12/12 KB   
           
Downloaded: http://repo.maven.apache.org/maven2/org/codehaus/plexus/plexus-digest/1.0/plexus-digest-1.0.jar
(12 KB at 330.9 KB/sec)
[INFO] Installing <https://builds.apache.org/job/Bigtop-trunk-test-execution/ws/bigtop-tests/test-execution/common/pom.xml>
to /home/jenkins/.m2/repository/org/apache/bigtop/itest/stacks-common/1.2.0-SNAPSHOT/stacks-common-1.2.0-SNAPSHOT.pom
[INFO] 
[INFO] --- maven-deploy-plugin:2.5:deploy (default-deploy) @ stacks-common ---
Downloading: https://repository.apache.org/content/repositories/snapshots/org/apache/bigtop/itest/stacks-common/1.2.0-SNAPSHOT/maven-metadata.xml
           
[WARNING] Could not transfer metadata org.apache.bigtop.itest:stacks-common:1.2.0-SNAPSHOT/maven-metadata.xml
from/to apache.snapshots.https (https://repository.apache.org/content/repositories/snapshots):
java.lang.RuntimeException: Could not generate DH keypair
[INFO] ------------------------------------------------------------------------
[INFO] Reactor Summary:
[INFO] 
[INFO] stacks-validation-common .......................... FAILURE [4.556s]
[INFO] smoke-tests-conf .................................. SKIPPED
[INFO] packagesmokes ..................................... SKIPPED
[INFO] bigtop-smokes ..................................... SKIPPED
[INFO] ------------------------------------------------------------------------
[INFO] BUILD FAILURE
[INFO] ------------------------------------------------------------------------
[INFO] Total time: 5.095s
[INFO] Finished at: Fri Feb 26 02:16:43 UTC 2016
[INFO] Final Memory: 9M/112M
[INFO] ------------------------------------------------------------------------
[ERROR] Failed to execute goal org.apache.maven.plugins:maven-deploy-plugin:2.5:deploy (default-deploy)
on project stacks-common: Failed to retrieve remote metadata org.apache.bigtop.itest:stacks-common:1.2.0-SNAPSHOT/maven-metadata.xml:
Could not transfer metadata org.apache.bigtop.itest:stacks-common:1.2.0-SNAPSHOT/maven-metadata.xml
from/to apache.snapshots.https (https://repository.apache.org/content/repositories/snapshots):
java.lang.RuntimeException: Could not generate DH keypair: Prime size must be multiple of
64, and can only range from 512 to 1024 (inclusive) -> [Help 1]
[ERROR] 
[ERROR] To see the full stack trace of the errors, re-run Maven with the -e switch.
[ERROR] Re-run Maven using the -X switch to enable full debug logging.
[ERROR] 
[ERROR] For more information about the errors and possible solutions, please read the following
articles:
[ERROR] [Help 1] http://cwiki.apache.org/confluence/display/MAVEN/MojoExecutionException
Build step 'Execute shell' marked build as failure

Mime
View raw message