bigtop-ci mailing list archives

Site index · List index
Message view « Date » · « Thread »
Top « Date » · « Thread »
From Apache Jenkins Server <jenk...@builds.apache.org>
Subject Build failed in Jenkins: Bigtop-trunk-test-execution #1826
Date Mon, 22 Feb 2016 19:33:53 GMT
See <https://builds.apache.org/job/Bigtop-trunk-test-execution/1826/changes>

Changes:

[of] BIGTOP-2344: distributions does not mention ppc64el, i386 obsolete

------------------------------------------
[...truncated 3439 lines...]
5756/6230 KB   
5760/6230 KB   
5764/6230 KB   
5768/6230 KB   
5772/6230 KB   
5776/6230 KB   
5780/6230 KB   
5784/6230 KB   
5788/6230 KB   
5792/6230 KB   
5796/6230 KB   
5800/6230 KB   
5804/6230 KB   
5805/6230 KB   
5809/6230 KB   
5813/6230 KB   
5817/6230 KB   
5819/6230 KB   
5823/6230 KB   
5827/6230 KB   
5831/6230 KB   
5835/6230 KB   
5839/6230 KB   
5843/6230 KB   
5847/6230 KB   
5851/6230 KB   
5855/6230 KB   
5859/6230 KB   
5863/6230 KB   
5867/6230 KB   
5871/6230 KB   
5875/6230 KB   
5879/6230 KB   
5883/6230 KB   
5887/6230 KB   
5891/6230 KB   
5895/6230 KB   
5899/6230 KB   
5903/6230 KB   
5904/6230 KB   
5908/6230 KB   
5912/6230 KB   
5916/6230 KB   
5918/6230 KB   
5922/6230 KB   
5926/6230 KB   
5930/6230 KB   
5934/6230 KB   
5938/6230 KB   
5942/6230 KB   
5946/6230 KB   
5950/6230 KB   
5954/6230 KB   
5958/6230 KB   
5962/6230 KB   
5966/6230 KB   
5970/6230 KB   
5974/6230 KB   
5978/6230 KB   
5982/6230 KB   
5986/6230 KB   
5990/6230 KB   
5994/6230 KB   
5998/6230 KB   
6002/6230 KB   
6006/6230 KB   
6007/6230 KB   
6011/6230 KB   
6015/6230 KB   
6019/6230 KB   
6023/6230 KB   
6027/6230 KB   
6031/6230 KB   
6035/6230 KB   
6039/6230 KB   
6041/6230 KB   
6045/6230 KB   
6049/6230 KB   
6053/6230 KB   
6057/6230 KB   
6061/6230 KB   
6065/6230 KB   
6069/6230 KB   
6073/6230 KB   
6077/6230 KB   
6081/6230 KB   
6085/6230 KB   
6087/6230 KB   
6091/6230 KB   
6095/6230 KB   
6099/6230 KB   
6103/6230 KB   
6107/6230 KB   
6111/6230 KB   
6115/6230 KB   
6119/6230 KB   
6123/6230 KB   
6127/6230 KB   
6131/6230 KB   
6135/6230 KB   
6139/6230 KB   
6143/6230 KB   
6147/6230 KB   
6151/6230 KB   
6155/6230 KB   
6159/6230 KB   
6163/6230 KB   
6167/6230 KB   
6171/6230 KB   
6175/6230 KB   
6179/6230 KB   
6183/6230 KB   
6187/6230 KB   
6191/6230 KB   
6195/6230 KB   
6199/6230 KB   
6203/6230 KB   
6207/6230 KB   
6211/6230 KB   
6215/6230 KB   
6219/6230 KB   
6223/6230 KB   
6227/6230 KB   
6230/6230 KB   
               
Downloaded: http://repo.maven.apache.org/maven2/org/codehaus/groovy/groovy-all/2.1.8/groovy-all-2.1.8.jar
(6230 KB at 14288.1 KB/sec)
[INFO] 
[INFO] --- maven-install-plugin:2.3:install (default-install) @ stacks-common ---
Downloading: http://repo.maven.apache.org/maven2/org/codehaus/plexus/plexus-utils/1.5.6/plexus-utils-1.5.6.pom
4/6 KB         
6/6 KB   
         
Downloaded: http://repo.maven.apache.org/maven2/org/codehaus/plexus/plexus-utils/1.5.6/plexus-utils-1.5.6.pom
(6 KB at 139.9 KB/sec)
Downloading: http://repo.maven.apache.org/maven2/org/codehaus/plexus/plexus/1.0.12/plexus-1.0.12.pom
4/10 KB   
8/10 KB   
10/10 KB   
           
Downloaded: http://repo.maven.apache.org/maven2/org/codehaus/plexus/plexus/1.0.12/plexus-1.0.12.pom
(10 KB at 478.5 KB/sec)
Downloading: http://repo.maven.apache.org/maven2/org/codehaus/plexus/plexus-digest/1.0/plexus-digest-1.0.pom
2/2 KB     
         
Downloaded: http://repo.maven.apache.org/maven2/org/codehaus/plexus/plexus-digest/1.0/plexus-digest-1.0.pom
(2 KB at 51.7 KB/sec)
Downloading: http://repo.maven.apache.org/maven2/org/codehaus/plexus/plexus-components/1.1.7/plexus-components-1.1.7.pom
4/5 KB   
5/5 KB   
         
Downloaded: http://repo.maven.apache.org/maven2/org/codehaus/plexus/plexus-components/1.1.7/plexus-components-1.1.7.pom
(5 KB at 242.9 KB/sec)
Downloading: http://repo.maven.apache.org/maven2/org/codehaus/plexus/plexus-utils/1.5.6/plexus-utils-1.5.6.jar
Downloading: http://repo.maven.apache.org/maven2/org/codehaus/plexus/plexus-digest/1.0/plexus-digest-1.0.jar
4/245 KB   
8/245 KB   
12/245 KB   
16/245 KB   
20/245 KB   
24/245 KB   
28/245 KB   
32/245 KB   
36/245 KB   
40/245 KB   
44/245 KB   
48/245 KB   
52/245 KB   
56/245 KB   
60/245 KB   
64/245 KB   
68/245 KB   
72/245 KB   
74/245 KB   
4/12 KB   74/245 KB   
8/12 KB   74/245 KB   
12/12 KB   74/245 KB   
12/12 KB   74/245 KB   
12/12 KB   78/245 KB   
12/12 KB   82/245 KB   
12/12 KB   86/245 KB   
12/12 KB   90/245 KB   
12/12 KB   94/245 KB   
12/12 KB   98/245 KB   
12/12 KB   102/245 KB   
12/12 KB   106/245 KB   
12/12 KB   110/245 KB   
12/12 KB   114/245 KB   
12/12 KB   118/245 KB   
12/12 KB   122/245 KB   
12/12 KB   126/245 KB   
12/12 KB   130/245 KB   
12/12 KB   134/245 KB   
12/12 KB   138/245 KB   
12/12 KB   142/245 KB   
12/12 KB   146/245 KB   
12/12 KB   148/245 KB   
12/12 KB   152/245 KB   
12/12 KB   156/245 KB   
12/12 KB   160/245 KB   
12/12 KB   164/245 KB   
12/12 KB   168/245 KB   
12/12 KB   172/245 KB   
12/12 KB   176/245 KB   
12/12 KB   180/245 KB   
                        
184/245 KB              
Downloaded: http://repo.maven.apache.org/maven2/org/codehaus/plexus/plexus-digest/1.0/plexus-digest-1.0.jar
(12 KB at 503.5 KB/sec)
188/245 KB   
192/245 KB   
196/245 KB   
200/245 KB   
204/245 KB   
208/245 KB   
212/245 KB   
216/245 KB   
220/245 KB   
224/245 KB   
227/245 KB   
231/245 KB   
235/245 KB   
239/245 KB   
243/245 KB   
245/245 KB   
             
Downloaded: http://repo.maven.apache.org/maven2/org/codehaus/plexus/plexus-utils/1.5.6/plexus-utils-1.5.6.jar
(245 KB at 6116.8 KB/sec)
[INFO] Installing <https://builds.apache.org/job/Bigtop-trunk-test-execution/ws/bigtop-tests/test-execution/common/pom.xml>
to /home/jenkins/.m2/repository/org/apache/bigtop/itest/stacks-common/1.2.0-SNAPSHOT/stacks-common-1.2.0-SNAPSHOT.pom
[INFO] 
[INFO] --- maven-deploy-plugin:2.5:deploy (default-deploy) @ stacks-common ---
Downloading: https://repository.apache.org/content/repositories/snapshots/org/apache/bigtop/itest/stacks-common/1.2.0-SNAPSHOT/maven-metadata.xml
             
[WARNING] Could not transfer metadata org.apache.bigtop.itest:stacks-common:1.2.0-SNAPSHOT/maven-metadata.xml
from/to apache.snapshots.https (https://repository.apache.org/content/repositories/snapshots):
java.lang.RuntimeException: Could not generate DH keypair
[INFO] ------------------------------------------------------------------------
[INFO] Reactor Summary:
[INFO] 
[INFO] stacks-validation-common .......................... FAILURE [7.335s]
[INFO] smoke-tests-conf .................................. SKIPPED
[INFO] packagesmokes ..................................... SKIPPED
[INFO] bigtop-smokes ..................................... SKIPPED
[INFO] ------------------------------------------------------------------------
[INFO] BUILD FAILURE
[INFO] ------------------------------------------------------------------------
[INFO] Total time: 7.875s
[INFO] Finished at: Mon Feb 22 19:33:53 UTC 2016
[INFO] Final Memory: 9M/71M
[INFO] ------------------------------------------------------------------------
[ERROR] Failed to execute goal org.apache.maven.plugins:maven-deploy-plugin:2.5:deploy (default-deploy)
on project stacks-common: Failed to retrieve remote metadata org.apache.bigtop.itest:stacks-common:1.2.0-SNAPSHOT/maven-metadata.xml:
Could not transfer metadata org.apache.bigtop.itest:stacks-common:1.2.0-SNAPSHOT/maven-metadata.xml
from/to apache.snapshots.https (https://repository.apache.org/content/repositories/snapshots):
java.lang.RuntimeException: Could not generate DH keypair: Prime size must be multiple of
64, and can only range from 512 to 1024 (inclusive) -> [Help 1]
[ERROR] 
[ERROR] To see the full stack trace of the errors, re-run Maven with the -e switch.
[ERROR] Re-run Maven using the -X switch to enable full debug logging.
[ERROR] 
[ERROR] For more information about the errors and possible solutions, please read the following
articles:
[ERROR] [Help 1] http://cwiki.apache.org/confluence/display/MAVEN/MojoExecutionException
Build step 'Execute shell' marked build as failure

Mime
View raw message