bigtop-ci mailing list archives

Site index · List index
Message view « Date » · « Thread »
Top « Date » · « Thread »
From Apache Jenkins Server <jenk...@builds.apache.org>
Subject Build failed in Jenkins: Bigtop-trunk-test-execution #1770
Date Wed, 06 Jan 2016 10:46:11 GMT
See <https://builds.apache.org/job/Bigtop-trunk-test-execution/1770/changes>

Changes:

[of] BGITOP-2212: Increase MaxPermSize for zeppelin (because of ppc64le)

------------------------------------------
[...truncated 2288 lines...]
5466/6230 KB   
5470/6230 KB   
5474/6230 KB   
5478/6230 KB   
5482/6230 KB   
5486/6230 KB   
5488/6230 KB   
5492/6230 KB   
5496/6230 KB   
5500/6230 KB   
5504/6230 KB   
5508/6230 KB   
5512/6230 KB   
5516/6230 KB   
5520/6230 KB   
5524/6230 KB   
5528/6230 KB   
5532/6230 KB   
5536/6230 KB   
5540/6230 KB   
5544/6230 KB   
5548/6230 KB   
5552/6230 KB   
5556/6230 KB   
5560/6230 KB   
5564/6230 KB   
5568/6230 KB   
5572/6230 KB   
5576/6230 KB   
5579/6230 KB   
5583/6230 KB   
5587/6230 KB   
5590/6230 KB   
5594/6230 KB   
5598/6230 KB   
5602/6230 KB   
5606/6230 KB   
5610/6230 KB   
5613/6230 KB   
5617/6230 KB   
5621/6230 KB   
5624/6230 KB   
5628/6230 KB   
5632/6230 KB   
5636/6230 KB   
5640/6230 KB   
5644/6230 KB   
5647/6230 KB   
5651/6230 KB   
5655/6230 KB   
5658/6230 KB   
5662/6230 KB   
5666/6230 KB   
5670/6230 KB   
5674/6230 KB   
5678/6230 KB   
5681/6230 KB   
5685/6230 KB   
5689/6230 KB   
5693/6230 KB   
5697/6230 KB   
5701/6230 KB   
5703/6230 KB   
5707/6230 KB   
5711/6230 KB   
5715/6230 KB   
5719/6230 KB   
5723/6230 KB   
5727/6230 KB   
5731/6230 KB   
5735/6230 KB   
5739/6230 KB   
5743/6230 KB   
5747/6230 KB   
5751/6230 KB   
5755/6230 KB   
5759/6230 KB   
5760/6230 KB   
5764/6230 KB   
5768/6230 KB   
5771/6230 KB   
5775/6230 KB   
5779/6230 KB   
5783/6230 KB   
5787/6230 KB   
5791/6230 KB   
5794/6230 KB   
5798/6230 KB   
5802/6230 KB   
5805/6230 KB   
5809/6230 KB   
5813/6230 KB   
5817/6230 KB   
5821/6230 KB   
5825/6230 KB   
5829/6230 KB   
5833/6230 KB   
5837/6230 KB   
5839/6230 KB   
5843/6230 KB   
5847/6230 KB   
5850/6230 KB   
5854/6230 KB   
5858/6230 KB   
5862/6230 KB   
5866/6230 KB   
5870/6230 KB   
5873/6230 KB   
5877/6230 KB   
5881/6230 KB   
5885/6230 KB   
5889/6230 KB   
5893/6230 KB   
5896/6230 KB   
5900/6230 KB   
5904/6230 KB   
5907/6230 KB   
5911/6230 KB   
5915/6230 KB   
5919/6230 KB   
5923/6230 KB   
5927/6230 KB   
5931/6230 KB   
5935/6230 KB   
5939/6230 KB   
5943/6230 KB   
5947/6230 KB   
5951/6230 KB   
5952/6230 KB   
5956/6230 KB   
5960/6230 KB   
5964/6230 KB   
5968/6230 KB   
5972/6230 KB   
5976/6230 KB   
5980/6230 KB   
5984/6230 KB   
5986/6230 KB   
5990/6230 KB   
5994/6230 KB   
5998/6230 KB   
6002/6230 KB   
6006/6230 KB   
6010/6230 KB   
6014/6230 KB   
6018/6230 KB   
6022/6230 KB   
6026/6230 KB   
6030/6230 KB   
6034/6230 KB   
6038/6230 KB   
6042/6230 KB   
6046/6230 KB   
6050/6230 KB   
6054/6230 KB   
6058/6230 KB   
6062/6230 KB   
6066/6230 KB   
6070/6230 KB   
6074/6230 KB   
6078/6230 KB   
6082/6230 KB   
6086/6230 KB   
6090/6230 KB   
6094/6230 KB   
6098/6230 KB   
6102/6230 KB   
6106/6230 KB   
6110/6230 KB   
6114/6230 KB   
6118/6230 KB   
6122/6230 KB   
6126/6230 KB   
6130/6230 KB   
6134/6230 KB   
6138/6230 KB   
6142/6230 KB   
6145/6230 KB   
6149/6230 KB   
6153/6230 KB   
6156/6230 KB   
6160/6230 KB   
6164/6230 KB   
6167/6230 KB   
6171/6230 KB   
6175/6230 KB   
6179/6230 KB   
6183/6230 KB   
6187/6230 KB   
6190/6230 KB   
6194/6230 KB   
6198/6230 KB   
6201/6230 KB   
6205/6230 KB   
6209/6230 KB   
6212/6230 KB   
6216/6230 KB   
6220/6230 KB   
6224/6230 KB   
6228/6230 KB   
6230/6230 KB   
               
Downloaded: http://repo.maven.apache.org/maven2/org/codehaus/groovy/groovy-all/2.1.8/groovy-all-2.1.8.jar
(6230 KB at 10417.4 KB/sec)
[INFO] 
[INFO] --- maven-install-plugin:2.3:install (default-install) @ stacks-common ---
Downloading: http://repo.maven.apache.org/maven2/org/codehaus/plexus/plexus-digest/1.0/plexus-digest-1.0.pom
2/2 KB         
         
Downloaded: http://repo.maven.apache.org/maven2/org/codehaus/plexus/plexus-digest/1.0/plexus-digest-1.0.pom
(2 KB at 25.9 KB/sec)
Downloading: http://repo.maven.apache.org/maven2/org/codehaus/plexus/plexus-components/1.1.7/plexus-components-1.1.7.pom
4/5 KB   
5/5 KB   
         
Downloaded: http://repo.maven.apache.org/maven2/org/codehaus/plexus/plexus-components/1.1.7/plexus-components-1.1.7.pom
(5 KB at 124.6 KB/sec)
Downloading: http://repo.maven.apache.org/maven2/org/codehaus/plexus/plexus-digest/1.0/plexus-digest-1.0.jar
4/12 KB   
8/12 KB   
12/12 KB   
12/12 KB   
           
Downloaded: http://repo.maven.apache.org/maven2/org/codehaus/plexus/plexus-digest/1.0/plexus-digest-1.0.jar
(12 KB at 289.5 KB/sec)
[INFO] Installing <https://builds.apache.org/job/Bigtop-trunk-test-execution/ws/bigtop-tests/test-execution/common/pom.xml>
to /home/jenkins/.m2/repository/org/apache/bigtop/itest/stacks-common/1.1.0-SNAPSHOT/stacks-common-1.1.0-SNAPSHOT.pom
[INFO] 
[INFO] --- maven-deploy-plugin:2.5:deploy (default-deploy) @ stacks-common ---
Downloading: https://repository.apache.org/content/repositories/snapshots/org/apache/bigtop/itest/stacks-common/1.1.0-SNAPSHOT/maven-metadata.xml
           
[WARNING] Could not transfer metadata org.apache.bigtop.itest:stacks-common:1.1.0-SNAPSHOT/maven-metadata.xml
from/to apache.snapshots.https (https://repository.apache.org/content/repositories/snapshots):
java.lang.RuntimeException: Could not generate DH keypair
[INFO] ------------------------------------------------------------------------
[INFO] Reactor Summary:
[INFO] 
[INFO] stacks-validation-common .......................... FAILURE [5.032s]
[INFO] smoke-tests-conf .................................. SKIPPED
[INFO] packagesmokes ..................................... SKIPPED
[INFO] bigtop-smokes ..................................... SKIPPED
[INFO] ------------------------------------------------------------------------
[INFO] BUILD FAILURE
[INFO] ------------------------------------------------------------------------
[INFO] Total time: 5.580s
[INFO] Finished at: Wed Jan 06 10:46:15 UTC 2016
[INFO] Final Memory: 10M/176M
[INFO] ------------------------------------------------------------------------
[ERROR] Failed to execute goal org.apache.maven.plugins:maven-deploy-plugin:2.5:deploy (default-deploy)
on project stacks-common: Failed to retrieve remote metadata org.apache.bigtop.itest:stacks-common:1.1.0-SNAPSHOT/maven-metadata.xml:
Could not transfer metadata org.apache.bigtop.itest:stacks-common:1.1.0-SNAPSHOT/maven-metadata.xml
from/to apache.snapshots.https (https://repository.apache.org/content/repositories/snapshots):
java.lang.RuntimeException: Could not generate DH keypair: Prime size must be multiple of
64, and can only range from 512 to 1024 (inclusive) -> [Help 1]
[ERROR] 
[ERROR] To see the full stack trace of the errors, re-run Maven with the -e switch.
[ERROR] Re-run Maven using the -X switch to enable full debug logging.
[ERROR] 
[ERROR] For more information about the errors and possible solutions, please read the following
articles:
[ERROR] [Help 1] http://cwiki.apache.org/confluence/display/MAVEN/MojoExecutionException
Build step 'Execute shell' marked build as failure

Mime
View raw message