bigtop-ci mailing list archives

Site index · List index
Message view « Date » · « Thread »
Top « Date » · « Thread »
From Apache Jenkins Server <jenk...@builds.apache.org>
Subject Build failed in Jenkins: Bigtop-trunk-testartifacts #2099
Date Sun, 31 Jan 2016 04:46:19 GMT
See <https://builds.apache.org/job/Bigtop-trunk-testartifacts/2099/changes>

Changes:

[cos] BIGTOP-2299. test resources are breaking rat

[cos] Release notes have to be updated for Bigtop 1.1.0: a blocker is

------------------------------------------
Started by an SCM change
[EnvInject] - Loading node environment variables.
Building remotely on ubuntu-4 (docker Ubuntu ubuntu4 ubuntu yahoo-not-h2) in workspace <https://builds.apache.org/job/Bigtop-trunk-testartifacts/ws/>
 > git rev-parse --is-inside-work-tree # timeout=10
Fetching changes from the remote Git repository
 > git config remote.origin.url https://git-wip-us.apache.org/repos/asf/bigtop.git # timeout=10
Fetching upstream changes from https://git-wip-us.apache.org/repos/asf/bigtop.git
 > git --version # timeout=10
 > git -c core.askpass=true fetch --tags --progress https://git-wip-us.apache.org/repos/asf/bigtop.git
+refs/heads/*:refs/remotes/origin/*
 > git rev-parse origin/master^{commit} # timeout=10
Checking out Revision 9974ff22c185668be2ed9181d660ea2db63ea787 (origin/master)
 > git config core.sparsecheckout # timeout=10
 > git checkout -f 9974ff22c185668be2ed9181d660ea2db63ea787
 > git rev-list f90bacc52ac1a5904cc95c26563aef4cdc99707f # timeout=10
Parsing POMs
Modules changed, recalculating dependency graph
Established TCP socket on 34654
maven3-agent.jar already up to date
maven3-interceptor.jar already up to date
maven3-interceptor-commons.jar already up to date
[test-artifacts] $ /home/jenkins/tools/java/latest1.6/bin/java -Xmx2g -Xms256m -XX:MaxPermSize=512m
-cp /home/jenkins/jenkins-slave/maven3-agent.jar:/home/jenkins/tools/maven/apache-maven-3.0.4/boot/plexus-classworlds-2.4.jar
org.jvnet.hudson.maven3.agent.Maven3Main /home/jenkins/tools/maven/apache-maven-3.0.4 /home/jenkins/jenkins-slave/slave.jar
/home/jenkins/jenkins-slave/maven3-interceptor.jar /home/jenkins/jenkins-slave/maven3-interceptor-commons.jar
34654
<===[JENKINS REMOTING CAPACITY]===>   channel started
Executing Maven:  -B -f <https://builds.apache.org/job/Bigtop-trunk-testartifacts/ws/bigtop-tests/test-artifacts/pom.xml>
-Dmaven.repo.local=/home/jenkins/jenkins-slave/maven-repositories/1 -U clean deploy
[INFO] Scanning for projects...
Downloading: http://repo.maven.apache.org/maven2/org/codehaus/groovy/groovy-eclipse-batch/maven-metadata.xml
Downloading: http://repository.codehaus.org/org/codehaus/groovy/groovy-eclipse-batch/maven-metadata.xml
Downloading: http://nexus.codehaus.org/snapshots/org/codehaus/groovy/groovy-eclipse-batch/maven-metadata.xml
Downloaded: http://repo.maven.apache.org/maven2/org/codehaus/groovy/groovy-eclipse-batch/maven-metadata.xml
(2 KB at 6.2 KB/sec)
[WARNING] Could not transfer metadata org.codehaus.groovy:groovy-eclipse-batch/maven-metadata.xml
from/to codehaus.org (http://repository.codehaus.org): repository.codehaus.org
[WARNING] Could not transfer metadata org.codehaus.groovy:groovy-eclipse-batch/maven-metadata.xml
from/to codehaus-snapshots (http://nexus.codehaus.org/snapshots/): nexus.codehaus.org
Downloading: http://nexus.codehaus.org/snapshots/org/codehaus/groovy/groovy-eclipse-batch/2.1.8-01-SNAPSHOT/maven-metadata.xml
Downloading: http://repository.codehaus.org/org/codehaus/groovy/groovy-eclipse-batch/2.1.8-01-SNAPSHOT/maven-metadata.xml
[WARNING] Could not transfer metadata org.codehaus.groovy:groovy-eclipse-batch:2.1.8-01-SNAPSHOT/maven-metadata.xml
from/to codehaus.org (http://repository.codehaus.org): repository.codehaus.org
[WARNING] Could not transfer metadata org.codehaus.groovy:groovy-eclipse-batch:2.1.8-01-SNAPSHOT/maven-metadata.xml
from/to codehaus-snapshots (http://nexus.codehaus.org/snapshots/): nexus.codehaus.org
Downloading: http://repository.codehaus.org/org/codehaus/groovy/groovy-eclipse-batch/2.2.1-01-SNAPSHOT/maven-metadata.xml
Downloading: http://nexus.codehaus.org/snapshots/org/codehaus/groovy/groovy-eclipse-batch/2.2.1-01-SNAPSHOT/maven-metadata.xml
[WARNING] Could not transfer metadata org.codehaus.groovy:groovy-eclipse-batch:2.2.1-01-SNAPSHOT/maven-metadata.xml
from/to codehaus.org (http://repository.codehaus.org): repository.codehaus.org
[WARNING] Could not transfer metadata org.codehaus.groovy:groovy-eclipse-batch:2.2.1-01-SNAPSHOT/maven-metadata.xml
from/to codehaus-snapshots (http://nexus.codehaus.org/snapshots/): nexus.codehaus.org
Downloading: http://repository.codehaus.org/org/codehaus/groovy/groovy-eclipse-batch/2.3.0-01-SNAPSHOT/maven-metadata.xml
Downloading: http://nexus.codehaus.org/snapshots/org/codehaus/groovy/groovy-eclipse-batch/2.3.0-01-SNAPSHOT/maven-metadata.xml
[WARNING] Could not transfer metadata org.codehaus.groovy:groovy-eclipse-batch:2.3.0-01-SNAPSHOT/maven-metadata.xml
from/to codehaus.org (http://repository.codehaus.org): repository.codehaus.org
[WARNING] Could not transfer metadata org.codehaus.groovy:groovy-eclipse-batch:2.3.0-01-SNAPSHOT/maven-metadata.xml
from/to codehaus-snapshots (http://nexus.codehaus.org/snapshots/): nexus.codehaus.org
Downloading: http://repository.codehaus.org/org/codehaus/groovy/groovy-eclipse-batch/2.3.1-01-SNAPSHOT/maven-metadata.xml
Downloading: http://nexus.codehaus.org/snapshots/org/codehaus/groovy/groovy-eclipse-batch/2.3.1-01-SNAPSHOT/maven-metadata.xml
[WARNING] Could not transfer metadata org.codehaus.groovy:groovy-eclipse-batch:2.3.1-01-SNAPSHOT/maven-metadata.xml
from/to codehaus.org (http://repository.codehaus.org): repository.codehaus.org
[WARNING] Could not transfer metadata org.codehaus.groovy:groovy-eclipse-batch:2.3.1-01-SNAPSHOT/maven-metadata.xml
from/to codehaus-snapshots (http://nexus.codehaus.org/snapshots/): nexus.codehaus.org
Downloading: http://repository.codehaus.org/org/codehaus/groovy/groovy-eclipse-batch/2.3.2-01-SNAPSHOT/maven-metadata.xml
Downloading: http://nexus.codehaus.org/snapshots/org/codehaus/groovy/groovy-eclipse-batch/2.3.2-01-SNAPSHOT/maven-metadata.xml
[WARNING] Could not transfer metadata org.codehaus.groovy:groovy-eclipse-batch:2.3.2-01-SNAPSHOT/maven-metadata.xml
from/to codehaus.org (http://repository.codehaus.org): repository.codehaus.org
[WARNING] Could not transfer metadata org.codehaus.groovy:groovy-eclipse-batch:2.3.2-01-SNAPSHOT/maven-metadata.xml
from/to codehaus-snapshots (http://nexus.codehaus.org/snapshots/): nexus.codehaus.org
Downloading: http://repository.codehaus.org/org/codehaus/groovy/groovy-eclipse-batch/2.3.3-01-SNAPSHOT/maven-metadata.xml
Downloading: http://nexus.codehaus.org/snapshots/org/codehaus/groovy/groovy-eclipse-batch/2.3.3-01-SNAPSHOT/maven-metadata.xml
[WARNING] Could not transfer metadata org.codehaus.groovy:groovy-eclipse-batch:2.3.3-01-SNAPSHOT/maven-metadata.xml
from/to codehaus.org (http://repository.codehaus.org): repository.codehaus.org
[WARNING] Could not transfer metadata org.codehaus.groovy:groovy-eclipse-batch:2.3.3-01-SNAPSHOT/maven-metadata.xml
from/to codehaus-snapshots (http://nexus.codehaus.org/snapshots/): nexus.codehaus.org
Downloading: http://nexus.codehaus.org/snapshots/org/codehaus/groovy/groovy-eclipse-batch/2.3.4-01-SNAPSHOT/maven-metadata.xml
Downloading: http://repository.codehaus.org/org/codehaus/groovy/groovy-eclipse-batch/2.3.4-01-SNAPSHOT/maven-metadata.xml
[WARNING] Could not transfer metadata org.codehaus.groovy:groovy-eclipse-batch:2.3.4-01-SNAPSHOT/maven-metadata.xml
from/to codehaus.org (http://repository.codehaus.org): repository.codehaus.org
[WARNING] Could not transfer metadata org.codehaus.groovy:groovy-eclipse-batch:2.3.4-01-SNAPSHOT/maven-metadata.xml
from/to codehaus-snapshots (http://nexus.codehaus.org/snapshots/): nexus.codehaus.org
[INFO] ------------------------------------------------------------------------
[INFO] Reactor Build Order:
[INFO] 
[INFO] bigtop-smokes
[INFO] hadoopsmoke
[INFO] packagesmoke
[INFO] httpfssmokes
[INFO] ooziesmoke
[INFO] hbasesmoke
[INFO] flumesmoke
[INFO] sqoopsmokes
[INFO] mahoutsmoke
[INFO] giraphsmoke
[INFO] huesmoke
[INFO] solrsmoke
[INFO] crunchsmoke
[INFO] datafusmoke
[INFO] io-longevity
[INFO] hcatalogsmoke
[INFO] sparksmoke
[INFO] phoenixsmoke
[INFO] fatjar
[INFO]                                                                         
[INFO] ------------------------------------------------------------------------
[INFO] Building bigtop-smokes 1.2.0-SNAPSHOT
[INFO] ------------------------------------------------------------------------
Downloading: http://repository.apache.org/snapshots/org/apache/bigtop/itest/itest-common/1.2.0-SNAPSHOT/maven-metadata.xml
Downloading: http://repository.apache.org/snapshots/org/apache/bigtop/itest/itest-common/1.2.0-SNAPSHOT/itest-common-1.2.0-SNAPSHOT.pom
[WARNING] The POM for org.apache.bigtop.itest:itest-common:jar:1.2.0-SNAPSHOT is missing,
no dependency information available
Downloading: http://repository.apache.org/snapshots/org/apache/bigtop/itest/itest-common/1.2.0-SNAPSHOT/itest-common-1.2.0-SNAPSHOT.jar
[INFO] ------------------------------------------------------------------------
[INFO] Reactor Summary:
[INFO] 
[INFO] bigtop-smokes ..................................... FAILURE [1.527s]
[INFO] hadoopsmoke ....................................... SKIPPED
[INFO] packagesmoke ...................................... SKIPPED
[INFO] httpfssmokes ...................................... SKIPPED
[INFO] ooziesmoke ........................................ SKIPPED
[INFO] hbasesmoke ........................................ SKIPPED
[INFO] flumesmoke ........................................ SKIPPED
[INFO] sqoopsmokes ....................................... SKIPPED
[INFO] mahoutsmoke ....................................... SKIPPED
[INFO] giraphsmoke ....................................... SKIPPED
[INFO] huesmoke .......................................... SKIPPED
[INFO] solrsmoke ......................................... SKIPPED
[INFO] crunchsmoke ....................................... SKIPPED
[INFO] datafusmoke ....................................... SKIPPED
[INFO] io-longevity ...................................... SKIPPED
[INFO] hcatalogsmoke ..................................... SKIPPED
[INFO] sparksmoke ........................................ SKIPPED
[INFO] phoenixsmoke ...................................... SKIPPED
[INFO] fatjar ............................................ SKIPPED
[INFO] ------------------------------------------------------------------------
[INFO] BUILD FAILURE
[INFO] ------------------------------------------------------------------------
[INFO] Total time: 5.456s
[INFO] Finished at: Sun Jan 31 04:46:20 UTC 2016
[INFO] Final Memory: 10M/245M
[INFO] ------------------------------------------------------------------------
Waiting for Jenkins to finish collecting data[ERROR] Failed to execute goal on project bigtop-smokes:
Could not resolve dependencies for project org.apache.bigtop.itest:bigtop-smokes:pom:1.2.0-SNAPSHOT:
Could not find artifact org.apache.bigtop.itest:itest-common:jar:1.2.0-SNAPSHOT in Nexus (http://repository.apache.org/snapshots)
-> [Help 1]

[ERROR] 
[ERROR] To see the full stack trace of the errors, re-run Maven with the -e switch.
[ERROR] Re-run Maven using the -X switch to enable full debug logging.
[ERROR] 
[ERROR] For more information about the errors and possible solutions, please read the following
articles:
[ERROR] [Help 1] http://cwiki.apache.org/confluence/display/MAVEN/DependencyResolutionException
[JENKINS] Archiving <https://builds.apache.org/job/Bigtop-trunk-testartifacts/ws/bigtop-tests/test-artifacts/pom.xml>
to org.apache.bigtop.itest/bigtop-smokes/1.2.0-SNAPSHOT/bigtop-smokes-1.2.0-SNAPSHOT.pom
[JENKINS] Archiving <https://builds.apache.org/job/Bigtop-trunk-testartifacts/ws/bigtop-tests/test-artifacts/sqoop/pom.xml>
to org.apache.bigtop.itest/sqoop-smoke/1.2.0-SNAPSHOT/sqoop-smoke-1.2.0-SNAPSHOT.pom
[JENKINS] Archiving <https://builds.apache.org/job/Bigtop-trunk-testartifacts/ws/bigtop-tests/test-artifacts/hue/pom.xml>
to org.apache.bigtop.itest/hue-smoke/1.2.0-SNAPSHOT/hue-smoke-1.2.0-SNAPSHOT.pom
[JENKINS] Archiving <https://builds.apache.org/job/Bigtop-trunk-testartifacts/ws/bigtop-tests/test-artifacts/crunch/pom.xml>
to org.apache.bigtop.itest/crunch-smoke/1.2.0-SNAPSHOT/crunch-smoke-1.2.0-SNAPSHOT.pom
[JENKINS] Archiving <https://builds.apache.org/job/Bigtop-trunk-testartifacts/ws/bigtop-tests/test-artifacts/package/pom.xml>
to org.apache.bigtop.itest/package-smoke/1.2.0-SNAPSHOT/package-smoke-1.2.0-SNAPSHOT.pom
[JENKINS] Archiving <https://builds.apache.org/job/Bigtop-trunk-testartifacts/ws/bigtop-tests/test-artifacts/flume/pom.xml>
to org.apache.bigtop.itest/flume-smoke/1.2.0-SNAPSHOT/flume-smoke-1.2.0-SNAPSHOT.pom
[JENKINS] Archiving <https://builds.apache.org/job/Bigtop-trunk-testartifacts/ws/bigtop-tests/test-artifacts/httpfs/pom.xml>
to org.apache.bigtop.itest/httpfs-smoke/1.2.0-SNAPSHOT/httpfs-smoke-1.2.0-SNAPSHOT.pom
[JENKINS] Archiving <https://builds.apache.org/job/Bigtop-trunk-testartifacts/ws/bigtop-tests/test-artifacts/spark/pom.xml>
to org.apache.bigtop.itest/spark-smoke/1.2.0-SNAPSHOT/spark-smoke-1.2.0-SNAPSHOT.pom
[JENKINS] Archiving <https://builds.apache.org/job/Bigtop-trunk-testartifacts/ws/bigtop-tests/test-artifacts/hadoop/pom.xml>
to org.apache.bigtop.itest/hadoop-smoke/1.2.0-SNAPSHOT/hadoop-smoke-1.2.0-SNAPSHOT.pom
[JENKINS] Archiving <https://builds.apache.org/job/Bigtop-trunk-testartifacts/ws/bigtop-tests/test-artifacts/oozie/pom.xml>
to org.apache.bigtop.itest/oozie-smoke/1.2.0-SNAPSHOT/oozie-smoke-1.2.0-SNAPSHOT.pom
[JENKINS] Archiving <https://builds.apache.org/job/Bigtop-trunk-testartifacts/ws/bigtop-tests/test-artifacts/giraph/pom.xml>
to org.apache.bigtop.itest/giraph-smoke/1.2.0-SNAPSHOT/giraph-smoke-1.2.0-SNAPSHOT.pom
[JENKINS] Archiving <https://builds.apache.org/job/Bigtop-trunk-testartifacts/ws/bigtop-tests/test-artifacts/hcatalog/pom.xml>
to org.apache.bigtop.itest/hcatalog-smoke/1.2.0-SNAPSHOT/hcatalog-smoke-1.2.0-SNAPSHOT.pom
[JENKINS] Archiving <https://builds.apache.org/job/Bigtop-trunk-testartifacts/ws/bigtop-tests/test-artifacts/datafu/pom.xml>
to org.apache.bigtop.itest/datafu-smoke/1.2.0-SNAPSHOT/datafu-smoke-1.2.0-SNAPSHOT.pom
[JENKINS] Archiving <https://builds.apache.org/job/Bigtop-trunk-testartifacts/ws/bigtop-tests/test-artifacts/longevity/pom.xml>
to org.apache.bigtop.itest/io-longevity/1.2.0-SNAPSHOT/io-longevity-1.2.0-SNAPSHOT.pom
[JENKINS] Archiving <https://builds.apache.org/job/Bigtop-trunk-testartifacts/ws/bigtop-tests/test-artifacts/mahout/pom.xml>
to org.apache.bigtop.itest/mahout-smoke/1.2.0-SNAPSHOT/mahout-smoke-1.2.0-SNAPSHOT.pom
[JENKINS] Archiving <https://builds.apache.org/job/Bigtop-trunk-testartifacts/ws/bigtop-tests/test-artifacts/hbase/pom.xml>
to org.apache.bigtop.itest/hbase-smoke/1.2.0-SNAPSHOT/hbase-smoke-1.2.0-SNAPSHOT.pom
[JENKINS] Archiving <https://builds.apache.org/job/Bigtop-trunk-testartifacts/ws/bigtop-tests/test-artifacts/solr/pom.xml>
to org.apache.bigtop.itest/solr-smoke/1.2.0-SNAPSHOT/solr-smoke-1.2.0-SNAPSHOT.pom
[JENKINS] Archiving <https://builds.apache.org/job/Bigtop-trunk-testartifacts/ws/bigtop-tests/test-artifacts/phoenix/pom.xml>
to org.apache.bigtop.itest/phoenix-smoke/1.2.0-SNAPSHOT/phoenix-smoke-1.2.0-SNAPSHOT.pom
[JENKINS] Archiving <https://builds.apache.org/job/Bigtop-trunk-testartifacts/ws/bigtop-tests/test-artifacts/fatjar/pom.xml>
to org.apache.bigtop.itest/fat-smoke/1.2.0-SNAPSHOT/fat-smoke-1.2.0-SNAPSHOT.pom
Sending e-mails to: ci@bigtop.apache.org
channel stopped

Mime
View raw message