bigtop-ci mailing list archives

Site index · List index
Message view « Date » · « Thread »
Top « Date » · « Thread »
From Apache Jenkins Server <jenk...@builds.apache.org>
Subject Build failed in Jenkins: Bigtop-trunk-test-execution #1721
Date Fri, 06 Nov 2015 20:32:44 GMT
See <https://builds.apache.org/job/Bigtop-trunk-test-execution/1721/changes>

Changes:

[cos] BIGTOP-2114. hive is broken after BIGTOP-2104

------------------------------------------
Started by an SCM change
Started by an SCM change
Started by an SCM change
Started by an SCM change
Started by an SCM change
Started by an SCM change
Started by an SCM change
Started by an SCM change
[EnvInject] - Loading node environment variables.
Building remotely on H11 (Ubuntu ubuntu) in workspace <https://builds.apache.org/job/Bigtop-trunk-test-execution/ws/>
 > git rev-parse --is-inside-work-tree # timeout=10
Fetching changes from the remote Git repository
 > git config remote.origin.url https://git-wip-us.apache.org/repos/asf/bigtop.git # timeout=10
Fetching upstream changes from https://git-wip-us.apache.org/repos/asf/bigtop.git
 > git --version # timeout=10
 > git -c core.askpass=true fetch --tags --progress https://git-wip-us.apache.org/repos/asf/bigtop.git
+refs/heads/*:refs/remotes/origin/*
 > git rev-parse origin/master^{commit} # timeout=10
Checking out Revision a5990c0480aa0fb4976c4c6332f880376dd22ca5 (origin/master)
 > git config core.sparsecheckout # timeout=10
 > git checkout -f a5990c0480aa0fb4976c4c6332f880376dd22ca5
 > git rev-list ed6377f693e7d2655172fd49e6e68ddc9d5709fd # timeout=10
[Bigtop-trunk-test-execution] $ /home/jenkins/tools/maven/apache-maven-3.0.4/bin/mvn -f bigtop-tests/test-execution/pom.xml
clean
[INFO] Scanning for projects...
[INFO] ------------------------------------------------------------------------
[INFO] Reactor Build Order:
[INFO] 
[INFO] stacks-validation-common
[INFO] smoke-tests-conf
[INFO] packagesmokes
[INFO] bigtop-smokes
[INFO]                                                                         
[INFO] ------------------------------------------------------------------------
[INFO] Building stacks-validation-common 1.1.0-SNAPSHOT
[INFO] ------------------------------------------------------------------------
[INFO] 
[INFO] --- maven-clean-plugin:2.4.1:clean (default-clean) @ stacks-common ---
[INFO] Deleting <https://builds.apache.org/job/Bigtop-trunk-test-execution/ws/bigtop-tests/test-execution/common/target>
[INFO]                                                                         
[INFO] ------------------------------------------------------------------------
[INFO] Building smoke-tests-conf 1.1.0-SNAPSHOT
[INFO] ------------------------------------------------------------------------
[INFO] 
[INFO] --- maven-clean-plugin:2.4.1:clean (default-clean) @ smoke-tests-conf ---
[INFO]                                                                         
[INFO] ------------------------------------------------------------------------
[INFO] Building packagesmokes 1.1.0-SNAPSHOT
[INFO] ------------------------------------------------------------------------
[INFO] 
[INFO] --- maven-clean-plugin:2.4.1:clean (default-clean) @ package-smoke-execution ---
[INFO]                                                                         
[INFO] ------------------------------------------------------------------------
[INFO] Building bigtop-smokes 1.1.0-SNAPSHOT
[INFO] ------------------------------------------------------------------------
[INFO] 
[INFO] --- maven-clean-plugin:2.4.1:clean (default-clean) @ bigtop-test-execution ---
[INFO] ------------------------------------------------------------------------
[INFO] Reactor Summary:
[INFO] 
[INFO] stacks-validation-common .......................... SUCCESS [0.201s]
[INFO] smoke-tests-conf .................................. SUCCESS [0.003s]
[INFO] packagesmokes ..................................... SUCCESS [0.110s]
[INFO] bigtop-smokes ..................................... SUCCESS [0.003s]
[INFO] ------------------------------------------------------------------------
[INFO] BUILD SUCCESS
[INFO] ------------------------------------------------------------------------
[INFO] Total time: 0.886s
[INFO] Finished at: Fri Nov 06 20:32:48 UTC 2015
[INFO] Final Memory: 4M/109M
[INFO] ------------------------------------------------------------------------
[Bigtop-trunk-test-execution] $ /bin/bash -xe /tmp/hudson6957137536402877968.sh
+ export HADOOP_CONF_DIR=
+ HADOOP_CONF_DIR=
+ export HADOOP_HOME=
+ HADOOP_HOME=
+ /home/jenkins/tools/maven/apache-maven-3.0.4/bin/mvn -f bigtop-tests/test-execution/pom.xml
-DskipTests -DskipITs deploy -DrepositoryId=apache.snapshots.https
[INFO] Scanning for projects...
[INFO] ------------------------------------------------------------------------
[INFO] Reactor Build Order:
[INFO] 
[INFO] stacks-validation-common
[INFO] smoke-tests-conf
[INFO] packagesmokes
[INFO] bigtop-smokes
[INFO]                                                                         
[INFO] ------------------------------------------------------------------------
[INFO] Building stacks-validation-common 1.1.0-SNAPSHOT
[INFO] ------------------------------------------------------------------------
[INFO] 
[INFO] --- maven-remote-resources-plugin:1.1:process (default) @ stacks-common ---
[INFO] Setting property: classpath.resource.loader.class => 'org.codehaus.plexus.velocity.ContextClassLoaderResourceLoader'.
[INFO] Setting property: velocimacro.messages.on => 'false'.
[INFO] Setting property: resource.loader => 'classpath'.
[INFO] Setting property: resource.manager.logwhenfound => 'false'.
[INFO] 
[INFO] --- maven-install-plugin:2.3:install (default-install) @ stacks-common ---
[INFO] Installing <https://builds.apache.org/job/Bigtop-trunk-test-execution/ws/bigtop-tests/test-execution/common/pom.xml>
to /home/jenkins/.m2/repository/org/apache/bigtop/itest/stacks-common/1.1.0-SNAPSHOT/stacks-common-1.1.0-SNAPSHOT.pom
[INFO] 
[INFO] --- maven-deploy-plugin:2.5:deploy (default-deploy) @ stacks-common ---
Downloading: https://repository.apache.org/content/repositories/snapshots/org/apache/bigtop/itest/stacks-common/1.1.0-SNAPSHOT/maven-metadata.xml

[WARNING] Could not transfer metadata org.apache.bigtop.itest:stacks-common:1.1.0-SNAPSHOT/maven-metadata.xml
from/to apache.snapshots.https (https://repository.apache.org/content/repositories/snapshots):
java.lang.RuntimeException: Could not generate DH keypair
[INFO] ------------------------------------------------------------------------
[INFO] Reactor Summary:
[INFO] 
[INFO] stacks-validation-common .......................... FAILURE [2.483s]
[INFO] smoke-tests-conf .................................. SKIPPED
[INFO] packagesmokes ..................................... SKIPPED
[INFO] bigtop-smokes ..................................... SKIPPED
[INFO] ------------------------------------------------------------------------
[INFO] BUILD FAILURE
[INFO] ------------------------------------------------------------------------
[INFO] Total time: 3.067s
[INFO] Finished at: Fri Nov 06 20:32:55 UTC 2015
[INFO] Final Memory: 10M/109M
[INFO] ------------------------------------------------------------------------
[ERROR] Failed to execute goal org.apache.maven.plugins:maven-deploy-plugin:2.5:deploy (default-deploy)
on project stacks-common: Failed to retrieve remote metadata org.apache.bigtop.itest:stacks-common:1.1.0-SNAPSHOT/maven-metadata.xml:
Could not transfer metadata org.apache.bigtop.itest:stacks-common:1.1.0-SNAPSHOT/maven-metadata.xml
from/to apache.snapshots.https (https://repository.apache.org/content/repositories/snapshots):
java.lang.RuntimeException: Could not generate DH keypair: Prime size must be multiple of
64, and can only range from 512 to 1024 (inclusive) -> [Help 1]
[ERROR] 
[ERROR] To see the full stack trace of the errors, re-run Maven with the -e switch.
[ERROR] Re-run Maven using the -X switch to enable full debug logging.
[ERROR] 
[ERROR] For more information about the errors and possible solutions, please read the following
articles:
[ERROR] [Help 1] http://cwiki.apache.org/confluence/display/MAVEN/MojoExecutionException
Build step 'Execute shell' marked build as failure

Mime
View raw message