bigtop-ci mailing list archives

Site index · List index
Message view « Date » · « Thread »
Top « Date » · « Thread »
From Apache Jenkins Server <jenk...@builds.apache.org>
Subject Build failed in Jenkins: Bigtop-trunk-test-execution #1722
Date Fri, 06 Nov 2015 21:46:43 GMT
See <https://builds.apache.org/job/Bigtop-trunk-test-execution/1722/changes>

Changes:

[of] BIGTOP-1905: Update Hue build for the upcoming 3.9 release

[of] BIGTOP-2028: Enhance puppet config of zookeeper to support kerberized

------------------------------------------
[...truncated 2599 lines...]
5432/6230 KB   
5436/6230 KB   
5440/6230 KB   
5444/6230 KB   
5448/6230 KB   
5452/6230 KB   
5456/6230 KB   
5460/6230 KB   
5464/6230 KB   
5468/6230 KB   
5472/6230 KB   
5476/6230 KB   
5480/6230 KB   
5484/6230 KB   
5488/6230 KB   
5492/6230 KB   
5496/6230 KB   
5500/6230 KB   
5504/6230 KB   
5508/6230 KB   
5512/6230 KB   
5516/6230 KB   
5520/6230 KB   
5524/6230 KB   
5528/6230 KB   
5532/6230 KB   
5536/6230 KB   
5540/6230 KB   
5544/6230 KB   
5548/6230 KB   
5552/6230 KB   
5556/6230 KB   
5560/6230 KB   
5564/6230 KB   
5568/6230 KB   
5572/6230 KB   
5576/6230 KB   
5580/6230 KB   
5584/6230 KB   
5588/6230 KB   
5589/6230 KB   
5593/6230 KB   
5597/6230 KB   
5601/6230 KB   
5605/6230 KB   
5609/6230 KB   
5613/6230 KB   
5617/6230 KB   
5621/6230 KB   
5625/6230 KB   
5629/6230 KB   
5633/6230 KB   
5637/6230 KB   
5641/6230 KB   
5645/6230 KB   
5649/6230 KB   
5653/6230 KB   
5657/6230 KB   
5661/6230 KB   
5665/6230 KB   
5669/6230 KB   
5673/6230 KB   
5677/6230 KB   
5681/6230 KB   
5685/6230 KB   
5689/6230 KB   
5693/6230 KB   
5697/6230 KB   
5701/6230 KB   
5705/6230 KB   
5709/6230 KB   
5713/6230 KB   
5717/6230 KB   
5721/6230 KB   
5725/6230 KB   
5729/6230 KB   
5733/6230 KB   
5737/6230 KB   
5741/6230 KB   
5745/6230 KB   
5749/6230 KB   
5753/6230 KB   
5757/6230 KB   
5761/6230 KB   
5765/6230 KB   
5769/6230 KB   
5773/6230 KB   
5777/6230 KB   
5781/6230 KB   
5785/6230 KB   
5789/6230 KB   
5793/6230 KB   
5797/6230 KB   
5801/6230 KB   
5805/6230 KB   
5809/6230 KB   
5813/6230 KB   
5817/6230 KB   
5821/6230 KB   
5825/6230 KB   
5829/6230 KB   
5833/6230 KB   
5837/6230 KB   
5841/6230 KB   
5845/6230 KB   
5849/6230 KB   
5853/6230 KB   
5857/6230 KB   
5861/6230 KB   
5865/6230 KB   
5869/6230 KB   
5873/6230 KB   
5877/6230 KB   
5881/6230 KB   
5885/6230 KB   
5889/6230 KB   
5893/6230 KB   
5897/6230 KB   
5901/6230 KB   
5905/6230 KB   
5909/6230 KB   
5913/6230 KB   
5917/6230 KB   
5921/6230 KB   
5925/6230 KB   
5929/6230 KB   
5933/6230 KB   
5937/6230 KB   
5941/6230 KB   
5945/6230 KB   
5949/6230 KB   
5953/6230 KB   
5957/6230 KB   
5961/6230 KB   
5965/6230 KB   
5969/6230 KB   
5973/6230 KB   
5977/6230 KB   
5981/6230 KB   
5985/6230 KB   
5989/6230 KB   
5993/6230 KB   
5997/6230 KB   
6001/6230 KB   
6005/6230 KB   
6009/6230 KB   
6013/6230 KB   
6017/6230 KB   
6021/6230 KB   
6025/6230 KB   
6029/6230 KB   
6033/6230 KB   
6037/6230 KB   
6041/6230 KB   
6045/6230 KB   
6049/6230 KB   
6053/6230 KB   
6057/6230 KB   
6061/6230 KB   
6065/6230 KB   
6069/6230 KB   
6073/6230 KB   
6077/6230 KB   
6081/6230 KB   
6085/6230 KB   
6089/6230 KB   
6093/6230 KB   
6097/6230 KB   
6101/6230 KB   
6105/6230 KB   
6109/6230 KB   
6113/6230 KB   
6117/6230 KB   
6121/6230 KB   
6125/6230 KB   
6129/6230 KB   
6133/6230 KB   
6137/6230 KB   
6141/6230 KB   
6145/6230 KB   
6149/6230 KB   
6153/6230 KB   
6157/6230 KB   
6161/6230 KB   
6165/6230 KB   
6169/6230 KB   
6173/6230 KB   
6177/6230 KB   
6181/6230 KB   
6185/6230 KB   
6189/6230 KB   
6193/6230 KB   
6197/6230 KB   
6201/6230 KB   
6205/6230 KB   
6209/6230 KB   
6213/6230 KB   
6217/6230 KB   
6221/6230 KB   
6225/6230 KB   
6229/6230 KB   
6230/6230 KB   
               
Downloaded: http://repo.maven.apache.org/maven2/org/codehaus/groovy/groovy-all/2.1.8/groovy-all-2.1.8.jar
(6230 KB at 24918.4 KB/sec)
[INFO] 
[INFO] --- maven-install-plugin:2.3:install (default-install) @ stacks-common ---
Downloading: http://repo.maven.apache.org/maven2/org/codehaus/plexus/plexus-digest/1.0/plexus-digest-1.0.pom
2/2 KB         
         
Downloaded: http://repo.maven.apache.org/maven2/org/codehaus/plexus/plexus-digest/1.0/plexus-digest-1.0.pom
(2 KB at 47.0 KB/sec)
Downloading: http://repo.maven.apache.org/maven2/org/codehaus/plexus/plexus-components/1.1.7/plexus-components-1.1.7.pom
4/5 KB   
5/5 KB   
         
Downloaded: http://repo.maven.apache.org/maven2/org/codehaus/plexus/plexus-components/1.1.7/plexus-components-1.1.7.pom
(5 KB at 231.4 KB/sec)
Downloading: http://repo.maven.apache.org/maven2/org/codehaus/plexus/plexus-digest/1.0/plexus-digest-1.0.jar
4/12 KB   
8/12 KB   
12/12 KB   
           
Downloaded: http://repo.maven.apache.org/maven2/org/codehaus/plexus/plexus-digest/1.0/plexus-digest-1.0.jar
(12 KB at 551.4 KB/sec)
[INFO] Installing <https://builds.apache.org/job/Bigtop-trunk-test-execution/ws/bigtop-tests/test-execution/common/pom.xml>
to /home/jenkins/.m2/repository/org/apache/bigtop/itest/stacks-common/1.1.0-SNAPSHOT/stacks-common-1.1.0-SNAPSHOT.pom
[INFO] 
[INFO] --- maven-deploy-plugin:2.5:deploy (default-deploy) @ stacks-common ---
Downloading: https://repository.apache.org/content/repositories/snapshots/org/apache/bigtop/itest/stacks-common/1.1.0-SNAPSHOT/maven-metadata.xml
           
[WARNING] Could not transfer metadata org.apache.bigtop.itest:stacks-common:1.1.0-SNAPSHOT/maven-metadata.xml
from/to apache.snapshots.https (https://repository.apache.org/content/repositories/snapshots):
java.lang.RuntimeException: Could not generate DH keypair
[INFO] ------------------------------------------------------------------------
[INFO] Reactor Summary:
[INFO] 
[INFO] stacks-validation-common .......................... FAILURE [4.084s]
[INFO] smoke-tests-conf .................................. SKIPPED
[INFO] packagesmokes ..................................... SKIPPED
[INFO] bigtop-smokes ..................................... SKIPPED
[INFO] ------------------------------------------------------------------------
[INFO] BUILD FAILURE
[INFO] ------------------------------------------------------------------------
[INFO] Total time: 4.618s
[INFO] Finished at: Fri Nov 06 21:46:54 UTC 2015
[INFO] Final Memory: 9M/111M
[INFO] ------------------------------------------------------------------------
[ERROR] Failed to execute goal org.apache.maven.plugins:maven-deploy-plugin:2.5:deploy (default-deploy)
on project stacks-common: Failed to retrieve remote metadata org.apache.bigtop.itest:stacks-common:1.1.0-SNAPSHOT/maven-metadata.xml:
Could not transfer metadata org.apache.bigtop.itest:stacks-common:1.1.0-SNAPSHOT/maven-metadata.xml
from/to apache.snapshots.https (https://repository.apache.org/content/repositories/snapshots):
java.lang.RuntimeException: Could not generate DH keypair: Prime size must be multiple of
64, and can only range from 512 to 1024 (inclusive) -> [Help 1]
[ERROR] 
[ERROR] To see the full stack trace of the errors, re-run Maven with the -e switch.
[ERROR] Re-run Maven using the -X switch to enable full debug logging.
[ERROR] 
[ERROR] For more information about the errors and possible solutions, please read the following
articles:
[ERROR] [Help 1] http://cwiki.apache.org/confluence/display/MAVEN/MojoExecutionException
Build step 'Execute shell' marked build as failure

Mime
View raw message