bigtop-ci mailing list archives

Site index · List index
Message view « Date » · « Thread »
Top « Date » · « Thread »
From Apache Jenkins Server <jenk...@builds.apache.org>
Subject Build failed in Jenkins: Bigtop-trunk-test-execution #1737
Date Mon, 16 Nov 2015 20:15:59 GMT
See <https://builds.apache.org/job/Bigtop-trunk-test-execution/1737/changes>

Changes:

[of] BIGTOP-2133: Running BPSGenerator using fat-jar fails on Mac OS X

------------------------------------------
[...truncated 2433 lines...]
5427/6230 KB   
5431/6230 KB   
5435/6230 KB   
5439/6230 KB   
5443/6230 KB   
5447/6230 KB   
5451/6230 KB   
5455/6230 KB   
5459/6230 KB   
5463/6230 KB   
5467/6230 KB   
5471/6230 KB   
5475/6230 KB   
5479/6230 KB   
5483/6230 KB   
5487/6230 KB   
5491/6230 KB   
5495/6230 KB   
5499/6230 KB   
5503/6230 KB   
5507/6230 KB   
5511/6230 KB   
5515/6230 KB   
5519/6230 KB   
5523/6230 KB   
5527/6230 KB   
5531/6230 KB   
5535/6230 KB   
5539/6230 KB   
5543/6230 KB   
5547/6230 KB   
5551/6230 KB   
5555/6230 KB   
5559/6230 KB   
5563/6230 KB   
5567/6230 KB   
5571/6230 KB   
5575/6230 KB   
5579/6230 KB   
5583/6230 KB   
5587/6230 KB   
5591/6230 KB   
5595/6230 KB   
5599/6230 KB   
5603/6230 KB   
5607/6230 KB   
5611/6230 KB   
5615/6230 KB   
5619/6230 KB   
5623/6230 KB   
5627/6230 KB   
5631/6230 KB   
5635/6230 KB   
5639/6230 KB   
5643/6230 KB   
5647/6230 KB   
5651/6230 KB   
5655/6230 KB   
5659/6230 KB   
5663/6230 KB   
5667/6230 KB   
5671/6230 KB   
5675/6230 KB   
5679/6230 KB   
5683/6230 KB   
5687/6230 KB   
5691/6230 KB   
5695/6230 KB   
5699/6230 KB   
5703/6230 KB   
5707/6230 KB   
5711/6230 KB   
5715/6230 KB   
5719/6230 KB   
5723/6230 KB   
5727/6230 KB   
5731/6230 KB   
5735/6230 KB   
5739/6230 KB   
5743/6230 KB   
5747/6230 KB   
5751/6230 KB   
5755/6230 KB   
5759/6230 KB   
5763/6230 KB   
5767/6230 KB   
5771/6230 KB   
5775/6230 KB   
5779/6230 KB   
5783/6230 KB   
5787/6230 KB   
5791/6230 KB   
5795/6230 KB   
5799/6230 KB   
5803/6230 KB   
5807/6230 KB   
5811/6230 KB   
5815/6230 KB   
5819/6230 KB   
5823/6230 KB   
5827/6230 KB   
5831/6230 KB   
5835/6230 KB   
5839/6230 KB   
5843/6230 KB   
5847/6230 KB   
5851/6230 KB   
5855/6230 KB   
5859/6230 KB   
5863/6230 KB   
5867/6230 KB   
5871/6230 KB   
5875/6230 KB   
5879/6230 KB   
5883/6230 KB   
5887/6230 KB   
5891/6230 KB   
5895/6230 KB   
5899/6230 KB   
5903/6230 KB   
5907/6230 KB   
5911/6230 KB   
5915/6230 KB   
5919/6230 KB   
5923/6230 KB   
5927/6230 KB   
5931/6230 KB   
5935/6230 KB   
5939/6230 KB   
5943/6230 KB   
5947/6230 KB   
5951/6230 KB   
5955/6230 KB   
5959/6230 KB   
5963/6230 KB   
5967/6230 KB   
5971/6230 KB   
5975/6230 KB   
5979/6230 KB   
5983/6230 KB   
5987/6230 KB   
5991/6230 KB   
5995/6230 KB   
5999/6230 KB   
6003/6230 KB   
6007/6230 KB   
6011/6230 KB   
6015/6230 KB   
6019/6230 KB   
6023/6230 KB   
6027/6230 KB   
6031/6230 KB   
6035/6230 KB   
6039/6230 KB   
6043/6230 KB   
6047/6230 KB   
6051/6230 KB   
6055/6230 KB   
6059/6230 KB   
6063/6230 KB   
6067/6230 KB   
6071/6230 KB   
6075/6230 KB   
6079/6230 KB   
6083/6230 KB   
6087/6230 KB   
6091/6230 KB   
6095/6230 KB   
6099/6230 KB   
6103/6230 KB   
6107/6230 KB   
6111/6230 KB   
6115/6230 KB   
6119/6230 KB   
6123/6230 KB   
6127/6230 KB   
6131/6230 KB   
6135/6230 KB   
6139/6230 KB   
6143/6230 KB   
6147/6230 KB   
6151/6230 KB   
6155/6230 KB   
6159/6230 KB   
6163/6230 KB   
6167/6230 KB   
6171/6230 KB   
6175/6230 KB   
6179/6230 KB   
6183/6230 KB   
6187/6230 KB   
6191/6230 KB   
6195/6230 KB   
6199/6230 KB   
6203/6230 KB   
6207/6230 KB   
6211/6230 KB   
6215/6230 KB   
6219/6230 KB   
6223/6230 KB   
6227/6230 KB   
6230/6230 KB   
               
Downloaded: http://repo.maven.apache.org/maven2/org/codehaus/groovy/groovy-all/2.1.8/groovy-all-2.1.8.jar
(6230 KB at 23777.1 KB/sec)
[INFO] 
[INFO] --- maven-install-plugin:2.3:install (default-install) @ stacks-common ---
Downloading: http://repo.maven.apache.org/maven2/org/codehaus/plexus/plexus-digest/1.0/plexus-digest-1.0.pom
2/2 KB         
         
Downloaded: http://repo.maven.apache.org/maven2/org/codehaus/plexus/plexus-digest/1.0/plexus-digest-1.0.pom
(2 KB at 49.2 KB/sec)
Downloading: http://repo.maven.apache.org/maven2/org/codehaus/plexus/plexus-components/1.1.7/plexus-components-1.1.7.pom
4/5 KB   
5/5 KB   
         
Downloaded: http://repo.maven.apache.org/maven2/org/codehaus/plexus/plexus-components/1.1.7/plexus-components-1.1.7.pom
(5 KB at 211.2 KB/sec)
Downloading: http://repo.maven.apache.org/maven2/org/codehaus/plexus/plexus-digest/1.0/plexus-digest-1.0.jar
4/12 KB   
8/12 KB   
12/12 KB   
           
Downloaded: http://repo.maven.apache.org/maven2/org/codehaus/plexus/plexus-digest/1.0/plexus-digest-1.0.jar
(12 KB at 526.4 KB/sec)
[INFO] Installing <https://builds.apache.org/job/Bigtop-trunk-test-execution/ws/bigtop-tests/test-execution/common/pom.xml>
to /home/jenkins/.m2/repository/org/apache/bigtop/itest/stacks-common/1.1.0-SNAPSHOT/stacks-common-1.1.0-SNAPSHOT.pom
[INFO] 
[INFO] --- maven-deploy-plugin:2.5:deploy (default-deploy) @ stacks-common ---
Downloading: https://repository.apache.org/content/repositories/snapshots/org/apache/bigtop/itest/stacks-common/1.1.0-SNAPSHOT/maven-metadata.xml
           
[WARNING] Could not transfer metadata org.apache.bigtop.itest:stacks-common:1.1.0-SNAPSHOT/maven-metadata.xml
from/to apache.snapshots.https (https://repository.apache.org/content/repositories/snapshots):
java.lang.RuntimeException: Could not generate DH keypair
[INFO] ------------------------------------------------------------------------
[INFO] Reactor Summary:
[INFO] 
[INFO] stacks-validation-common .......................... FAILURE [3.842s]
[INFO] smoke-tests-conf .................................. SKIPPED
[INFO] packagesmokes ..................................... SKIPPED
[INFO] bigtop-smokes ..................................... SKIPPED
[INFO] ------------------------------------------------------------------------
[INFO] BUILD FAILURE
[INFO] ------------------------------------------------------------------------
[INFO] Total time: 4.390s
[INFO] Finished at: Mon Nov 16 20:16:01 UTC 2015
[INFO] Final Memory: 9M/111M
[INFO] ------------------------------------------------------------------------
[ERROR] Failed to execute goal org.apache.maven.plugins:maven-deploy-plugin:2.5:deploy (default-deploy)
on project stacks-common: Failed to retrieve remote metadata org.apache.bigtop.itest:stacks-common:1.1.0-SNAPSHOT/maven-metadata.xml:
Could not transfer metadata org.apache.bigtop.itest:stacks-common:1.1.0-SNAPSHOT/maven-metadata.xml
from/to apache.snapshots.https (https://repository.apache.org/content/repositories/snapshots):
java.lang.RuntimeException: Could not generate DH keypair: Prime size must be multiple of
64, and can only range from 512 to 1024 (inclusive) -> [Help 1]
[ERROR] 
[ERROR] To see the full stack trace of the errors, re-run Maven with the -e switch.
[ERROR] Re-run Maven using the -X switch to enable full debug logging.
[ERROR] 
[ERROR] For more information about the errors and possible solutions, please read the following
articles:
[ERROR] [Help 1] http://cwiki.apache.org/confluence/display/MAVEN/MojoExecutionException
Build step 'Execute shell' marked build as failure

Mime
View raw message