bigtop-ci mailing list archives

Site index · List index
Message view « Date » · « Thread »
Top « Date » · « Thread »
From Apache Jenkins Server <jenk...@builds.apache.org>
Subject Build failed in Jenkins: Bigtop-trunk-iTest #2395
Date Tue, 10 Nov 2015 21:43:41 GMT
See <https://builds.apache.org/job/Bigtop-trunk-iTest/2395/changes>

Changes:

[of] BIGTOP-2127: opensuse: fix kerberos python module

------------------------------------------
[...truncated 35 lines...]
MAVEN_OPTS=-Xmx2g -Xms256m -XX:MaxPermSize=512m
NLSPATH=/usr/dt/lib/nls/msg/%L/%N.cat
GIT_COMMIT=49364d2e95e91c4753be80efd60d209a7dbb9817
JENKINS_HOME=/x1/jenkins/jenkins-home
ROOT_BUILD_CAUSE_SCMTRIGGER=true
MAVEN_HOME=/home/jenkins/tools/maven/apache-maven-3.0.4
PATH=/home/hudson/tools/java/latest/bin:/home/jenkins/tools/maven/apache-maven-3.0.4/bin:/home/jenkins/tools/java/latest1.6/bin:/usr/local/sbin:/usr/local/bin:/usr/sbin:/usr/bin:/sbin:/bin:/usr/bin/X11:/usr/games
MAIL=/var/mail/jenkins
BUILD_CAUSE_SCMTRIGGER=true
GIT_COMMITTER_EMAIL=builds@apache.org
PWD=/x1/jenkins/jenkins-slave/workspace/Bigtop-trunk-iTest
JAVA_HOME=/home/hudson/tools/java/latest
HUDSON_URL=https://builds.apache.org/
JOB_NAME=Bigtop-trunk-iTest
POM_VERSION=1.1.0-SNAPSHOT
BUILD_DISPLAY_NAME=#2395
XFILESEARCHPATH=/usr/dt/app-defaults/%L/Dt
BUILD_CAUSE=SCMTRIGGER
BUILD_ID=2395
JENKINS_URL=https://builds.apache.org/
GIT_PREVIOUS_SUCCESSFUL_COMMIT=73d4e98d29f9591b7cd3bebf1c9d07e7c06f5af5
POM_PACKAGING=jar
HOME=/home/jenkins
SHLVL=2
M2_HOME=/home/jenkins/tools/maven/apache-maven-3.0.4
GIT_BRANCH=origin/master
JENKINS_SERVER_COOKIE=f4ebd1e6b0d976e8
EXECUTOR_NUMBER=2
GIT_URL=https://git-wip-us.apache.org/repos/asf/bigtop.git
NODE_LABELS=Ubuntu legacy-ubuntu ubuntu ubuntu3
LOGNAME=jenkins
SSH_CONNECTION=140.211.11.14 34645 140.211.11.27 22
HUDSON_HOME=/x1/jenkins/jenkins-home
NODE_NAME=ubuntu3
BUILD_NUMBER=2395
HUDSON_COOKIE=275a5761-8bf1-4c7a-a758-bcaf2b121e51
GIT_AUTHOR_EMAIL=builds@apache.org
_=/usr/bin/env
Parsing POMs
Established TCP socket on 46417
maven3-agent.jar already up to date
maven3-interceptor.jar already up to date
maven3-interceptor-commons.jar already up to date
[bigtop-test-framework] $ /home/jenkins/tools/java/latest1.6/bin/java -Xmx2g -Xms256m -XX:MaxPermSize=512m
-cp /home/jenkins/jenkins-slave/maven3-agent.jar:/home/jenkins/tools/maven/apache-maven-3.0.4/boot/plexus-classworlds-2.4.jar
org.jvnet.hudson.maven3.agent.Maven3Main /home/jenkins/tools/maven/apache-maven-3.0.4 /x1/jenkins/jenkins-slave/slave.jar
/home/jenkins/jenkins-slave/maven3-interceptor.jar /home/jenkins/jenkins-slave/maven3-interceptor-commons.jar
46417
<===[JENKINS REMOTING CAPACITY]===>   channel started
Executing Maven:  -B -f <https://builds.apache.org/job/Bigtop-trunk-iTest/ws/bigtop-test-framework/pom.xml>
-Dmaven.repo.local=/home/jenkins/jenkins-slave/maven-repositories/2 clean deploy -DskipITs
[INFO] Scanning for projects...
Downloading: http://repository.codehaus.org/org/codehaus/groovy/groovy-eclipse-batch/maven-metadata.xml
Downloading: http://nexus.codehaus.org/snapshots/org/codehaus/groovy/groovy-eclipse-batch/maven-metadata.xml
[WARNING] Could not transfer metadata org.codehaus.groovy:groovy-eclipse-batch/maven-metadata.xml
from/to codehaus.org (http://repository.codehaus.org): repository.codehaus.org
[WARNING] Could not transfer metadata org.codehaus.groovy:groovy-eclipse-batch/maven-metadata.xml
from/to codehaus-snapshots (http://nexus.codehaus.org/snapshots/): nexus.codehaus.org
[INFO]                                                                         
[INFO] ------------------------------------------------------------------------
[INFO] Building iTest: system and integration testing in the cloud 1.1.0-SNAPSHOT
[INFO] ------------------------------------------------------------------------
[INFO] 
[INFO] --- maven-clean-plugin:2.4.1:clean (default-clean) @ itest-common ---
[INFO] Deleting <https://builds.apache.org/job/Bigtop-trunk-iTest/ws/bigtop-test-framework/target>
[INFO] 
[INFO] --- groovy-eclipse-compiler:2.8.0-01:add-groovy-build-paths (default-add-groovy-build-paths)
@ itest-common ---
[WARNING] Failure to transfer org.codehaus.groovy:groovy-eclipse-batch/maven-metadata.xml
from http://repository.codehaus.org was cached in the local repository, resolution will not
be reattempted until the update interval of codehaus.org has elapsed or updates are forced.
Original error: Could not transfer metadata org.codehaus.groovy:groovy-eclipse-batch/maven-metadata.xml
from/to codehaus.org (http://repository.codehaus.org): repository.codehaus.org
[WARNING] Failure to transfer org.codehaus.groovy:groovy-eclipse-batch/maven-metadata.xml
from http://nexus.codehaus.org/snapshots/ was cached in the local repository, resolution will
not be reattempted until the update interval of codehaus-snapshots has elapsed or updates
are forced. Original error: Could not transfer metadata org.codehaus.groovy:groovy-eclipse-batch/maven-metadata.xml
from/to codehaus-snapshots (http://nexus.codehaus.org/snapshots/): nexus.codehaus.org
[INFO] Adding /src/main/groovy to the list of source folders
[INFO] Adding /src/test/groovy to the list of test source folders
[INFO] 
[INFO] --- maven-remote-resources-plugin:1.1:process (default) @ itest-common ---
[INFO] Setting property: classpath.resource.loader.class => 'org.codehaus.plexus.velocity.ContextClassLoaderResourceLoader'.
[INFO] Setting property: velocimacro.messages.on => 'false'.
[INFO] Setting property: resource.loader => 'classpath'.
[INFO] Setting property: resource.manager.logwhenfound => 'false'.
[INFO] 
[INFO] --- maven-resources-plugin:2.4:resources (default-resources) @ itest-common ---
[INFO] Using 'UTF-8' encoding to copy filtered resources.
[INFO] skip non existing resourceDirectory <https://builds.apache.org/job/Bigtop-trunk-iTest/ws/bigtop-test-framework/src/main/resources>
[INFO] Copying 3 resources
[INFO] 
[INFO] --- maven-compiler-plugin:3.1:compile (default-compile) @ itest-common ---
[INFO] Changes detected - recompiling the module!
[INFO] Using Groovy-Eclipse compiler to compile both Java and Groovy files
[INFO] 
[INFO] --- maven-resources-plugin:2.4:testResources (default-testResources) @ itest-common
---
[INFO] Using 'UTF-8' encoding to copy filtered resources.
[INFO] skip non existing resourceDirectory <https://builds.apache.org/job/Bigtop-trunk-iTest/ws/bigtop-test-framework/src/test/resources>
[INFO] Copying 3 resources
[INFO] 
[INFO] --- maven-compiler-plugin:3.1:testCompile (default-testCompile) @ itest-common ---
[INFO] Changes detected - recompiling the module!
[INFO] Using Groovy-Eclipse compiler to compile both Java and Groovy files
[INFO] 
[INFO] --- maven-surefire-plugin:2.7:test (default-test) @ itest-common ---
[INFO] Surefire report directory: <https://builds.apache.org/job/Bigtop-trunk-iTest/ws/bigtop-test-framework/target/surefire-reports>

-------------------------------------------------------
 T E S T S
-------------------------------------------------------
Running org.apache.bigtop.itest.TestContractJavaProc
Tests run: 2, Failures: 0, Errors: 0, Skipped: 0, Time elapsed: 0.073 sec
Running org.apache.bigtop.itest.pmanager.PackageManagerTest
/etc/cron.weekly/.placeholder
/etc/init/cron.conf
/etc/cron.hourly/.placeholder
/etc/cron.monthly/.placeholder
/etc/default/cron
/etc/pam.d/cron
/etc/cron.daily/.placeholder
/etc/cron.daily/standard
/etc/cron.d/.placeholder
/etc/crontab
/.
/var
/var/spool
/var/spool/cron
/var/spool/cron/crontabs
/usr
/usr/sbin
/usr/sbin/cron
/usr/bin
/usr/bin/crontab
/usr/share
/usr/share/bug
/usr/share/bug/cron
/usr/share/bug/cron/control
/usr/share/bug/cron/script
/usr/share/doc
/usr/share/doc/cron
/usr/share/doc/cron/README
/usr/share/doc/cron/THANKS
/usr/share/doc/cron/TODO.Debian
/usr/share/doc/cron/changelog.Debian.gz
/usr/share/doc/cron/README.Debian
/usr/share/doc/cron/copyright
/usr/share/doc/cron/README.anacron
/usr/share/doc/cron/examples
/usr/share/doc/cron/examples/cron-stats.pl
/usr/share/doc/cron/examples/crontab2english.pl
/usr/share/doc/cron/examples/cron-tasks-review.sh
/usr/share/doc/cron/NEWS.Debian.gz
/usr/share/doc/cron/FEATURES
/usr/share/man
/usr/share/man/man1
/usr/share/man/man1/crontab.1.gz
/usr/share/man/man5
/usr/share/man/man5/crontab.5.gz
/usr/share/man/man8
/usr/share/man/man8/cron.8.gz
/etc
/etc/cron.weekly
/etc/cron.weekly/.placeholder
/etc/init.d
/etc/init
/etc/init/cron.conf
/etc/cron.hourly
/etc/cron.hourly/.placeholder
/etc/cron.monthly
/etc/cron.monthly/.placeholder
/etc/default
/etc/default/cron
/etc/pam.d
/etc/pam.d/cron
/etc/cron.daily
/etc/cron.daily/.placeholder
/etc/cron.daily/standard
/etc/cron.d
/etc/cron.d/.placeholder
/etc/crontab
/etc/init.d/cron
Tests run: 11, Failures: 0, Errors: 0, Skipped: 3, Time elapsed: 4.149 sec
Running org.apache.bigtop.itest.JarContentTest
log4j:WARN No appenders could be found for logger (org.apache.bigtop.itest.JarContent).
log4j:WARN Please initialize the log4j system properly.
Tests run: 6, Failures: 0, Errors: 0, Skipped: 0, Time elapsed: 0.862 sec
Running org.apache.bigtop.itest.JUnitUtilsTest
Disclaimer: This test expected to show a failure in an embeded testcase
    [junit] Running org.apache.bigtop.itest.DummyTestPassTests run: 1, Failures: 0, Errors:
0, Time elapsed: 0.249 secRunning org.apache.bigtop.itest.DummyTestFail
    [junit] Tests run: 1, Failures: 1, Errors: 0, Time elapsed: 0.12 secTEST org.apache.bigtop.itest.DummyTestFail
FAILED
    [junit] Tests FAILED
Disclaimer: This test expected to show an error in an embeded testcase
    [junit] Running org.apache.bigtop.itest.DummyTestError
    [junit] Tests run: 1, Failures: 0, Errors: 1, Time elapsed: 0.261 sec
    [junit] Test org.apache.bigtop.itest.DummyTestError FAILED
    [junit] Running org.apache.bigtop.itest.DummyTestPassTests run: 1, Failures: 0, Errors:
0, Time elapsed: 0.234 sec
    [junit] Running org.apache.bigtop.itest.DummyTestPassTests run: 1, Failures: 0, Errors:
0, Time elapsed: 0.237 sec
Tests run: 4, Failures: 0, Errors: 0, Skipped: 0, Time elapsed: 4.271 sec
Running org.apache.bigtop.itest.TestContractGroovy
Tests run: 2, Failures: 0, Errors: 0, Skipped: 0, Time elapsed: 0.013 sec
Running org.apache.bigtop.itest.posix.AlternativeTest
Tests run: 1, Failures: 0, Errors: 0, Skipped: 0, Time elapsed: 1.315 sec
Running org.apache.bigtop.itest.posix.UGITest
Tests run: 2, Failures: 0, Errors: 0, Skipped: 0, Time elapsed: 0.027 sec
Running org.apache.bigtop.itest.posix.ServiceTest
Status []
Tests run: 2, Failures: 0, Errors: 0, Skipped: 1, Time elapsed: 0.069 sec
Running org.apache.bigtop.itest.TestContractJava
Tests run: 2, Failures: 0, Errors: 0, Skipped: 0, Time elapsed: 0.002 sec
Running org.apache.bigtop.itest.shell.ShellTest
Tests run: 2, Failures: 0, Errors: 0, Skipped: 1, Time elapsed: 0.006 sec
Running org.apache.bigtop.itest.junit.OrderedParameterizedTest
Tests run: 3, Failures: 0, Errors: 0, Skipped: 0, Time elapsed: 0.027 sec
Running org.apache.bigtop.itest.junit.OrderedTest
Tests run: 3, Failures: 0, Errors: 0, Skipped: 0, Time elapsed: 0.005 sec
Running org.apache.bigtop.itest.TestListUtilsTest
Tests run: 1, Failures: 0, Errors: 0, Skipped: 0, Time elapsed: 0.011 sec

Results :

Tests run: 41, Failures: 0, Errors: 0, Skipped: 5

[JENKINS] Recording test results
log4j:WARN No appenders could be found for logger (org.apache.commons.beanutils.converters.BooleanConverter).
log4j:WARN Please initialize the log4j system properly.
[INFO] 
[INFO] --- maven-jar-plugin:2.2:jar (default-jar) @ itest-common ---
[INFO] Building jar: <https://builds.apache.org/job/Bigtop-trunk-iTest/ws/bigtop-test-framework/target/itest-common-1.1.0-SNAPSHOT.jar>
[INFO] 
[INFO] --- maven-jar-plugin:2.2:test-jar (default) @ itest-common ---
[INFO] Building jar: <https://builds.apache.org/job/Bigtop-trunk-iTest/ws/bigtop-test-framework/target/itest-common-1.1.0-SNAPSHOT-tests.jar>
[INFO] 
[INFO] --- maven-failsafe-plugin:2.17:verify (default) @ itest-common ---
[INFO] Tests are skipped.
[JENKINS] Recording test results
[INFO] 
[INFO] --- maven-install-plugin:2.3:install (default-install) @ itest-common ---
[INFO] Installing <https://builds.apache.org/job/Bigtop-trunk-iTest/ws/bigtop-test-framework/target/itest-common-1.1.0-SNAPSHOT.jar>
to /home/jenkins/jenkins-slave/maven-repositories/2/org/apache/bigtop/itest/itest-common/1.1.0-SNAPSHOT/itest-common-1.1.0-SNAPSHOT.jar
[INFO] Installing <https://builds.apache.org/job/Bigtop-trunk-iTest/ws/bigtop-test-framework/pom.xml>
to /home/jenkins/jenkins-slave/maven-repositories/2/org/apache/bigtop/itest/itest-common/1.1.0-SNAPSHOT/itest-common-1.1.0-SNAPSHOT.pom
[INFO] Installing <https://builds.apache.org/job/Bigtop-trunk-iTest/ws/bigtop-test-framework/target/itest-common-1.1.0-SNAPSHOT-tests.jar>
to /home/jenkins/jenkins-slave/maven-repositories/2/org/apache/bigtop/itest/itest-common/1.1.0-SNAPSHOT/itest-common-1.1.0-SNAPSHOT-tests.jar
[INFO] 
[INFO] --- maven-deploy-plugin:2.5:deploy (default-deploy) @ itest-common ---
Downloading: https://repository.apache.org/content/repositories/snapshots/org/apache/bigtop/itest/itest-common/1.1.0-SNAPSHOT/maven-metadata.xml
[WARNING] Could not transfer metadata org.apache.bigtop.itest:itest-common:1.1.0-SNAPSHOT/maven-metadata.xml
from/to apache.snapshots.https (https://repository.apache.org/content/repositories/snapshots):
java.lang.RuntimeException: Could not generate DH keypair
[INFO] ------------------------------------------------------------------------
[INFO] BUILD FAILURE
[INFO] ------------------------------------------------------------------------
[INFO] Total time: 25.912s
[INFO] Finished at: Tue Nov 10 21:43:57 UTC 2015
[INFO] Final Memory: 22M/246M
[INFO] ------------------------------------------------------------------------
Waiting for Jenkins to finish collecting data
[ERROR] Failed to execute goal org.apache.maven.plugins:maven-deploy-plugin:2.5:deploy (default-deploy)
on project itest-common: Failed to retrieve remote metadata org.apache.bigtop.itest:itest-common:1.1.0-SNAPSHOT/maven-metadata.xml:
Could not transfer metadata org.apache.bigtop.itest:itest-common:1.1.0-SNAPSHOT/maven-metadata.xml
from/to apache.snapshots.https (https://repository.apache.org/content/repositories/snapshots):
java.lang.RuntimeException: Could not generate DH keypair: Prime size must be multiple of
64, and can only range from 512 to 1024 (inclusive) -> [Help 1]
[ERROR] 
[ERROR] To see the full stack trace of the errors, re-run Maven with the -e switch.
[ERROR] Re-run Maven using the -X switch to enable full debug logging.
[ERROR] 
[ERROR] For more information about the errors and possible solutions, please read the following
articles:
[ERROR] [Help 1] http://cwiki.apache.org/confluence/display/MAVEN/MojoExecutionException
[JENKINS] Archiving <https://builds.apache.org/job/Bigtop-trunk-iTest/ws/bigtop-test-framework/pom.xml>
to org.apache.bigtop.itest/itest-common/1.1.0-SNAPSHOT/itest-common-1.1.0-SNAPSHOT.pom
[JENKINS] Archiving <https://builds.apache.org/job/Bigtop-trunk-iTest/ws/bigtop-test-framework/target/itest-common-1.1.0-SNAPSHOT.jar>
to org.apache.bigtop.itest/itest-common/1.1.0-SNAPSHOT/itest-common-1.1.0-SNAPSHOT.jar
[JENKINS] Archiving <https://builds.apache.org/job/Bigtop-trunk-iTest/ws/bigtop-test-framework/target/itest-common-1.1.0-SNAPSHOT-tests.jar>
to org.apache.bigtop.itest/itest-common/1.1.0-SNAPSHOT/itest-common-1.1.0-SNAPSHOT-tests.jar
Sending e-mails to: ci@bigtop.apache.org
channel stopped

Mime
View raw message