bigtop-ci mailing list archives

Site index · List index
Message view « Date » · « Thread »
Top « Date » · « Thread »
From Apache Jenkins Server <jenk...@builds.apache.org>
Subject Build failed in Jenkins: Bigtop-trunk-test-execution #1708
Date Wed, 14 Oct 2015 20:00:40 GMT
See <https://builds.apache.org/job/Bigtop-trunk-test-execution/1708/changes>

Changes:

[of] BIGTOP-2084: rename all puppet modules to have an underscore rather a

------------------------------------------
[...truncated 3389 lines...]
5731/6230 KB   
5735/6230 KB   
5739/6230 KB   
5743/6230 KB   
5747/6230 KB   
5751/6230 KB   
5755/6230 KB   
5759/6230 KB   
5763/6230 KB   
5767/6230 KB   
5771/6230 KB   
5775/6230 KB   
5779/6230 KB   
5783/6230 KB   
5787/6230 KB   
5791/6230 KB   
5795/6230 KB   
5799/6230 KB   
5803/6230 KB   
5807/6230 KB   
5811/6230 KB   
5815/6230 KB   
5819/6230 KB   
5823/6230 KB   
5827/6230 KB   
5831/6230 KB   
5835/6230 KB   
5839/6230 KB   
5843/6230 KB   
5847/6230 KB   
5851/6230 KB   
5855/6230 KB   
5859/6230 KB   
5863/6230 KB   
5867/6230 KB   
5871/6230 KB   
5875/6230 KB   
5879/6230 KB   
5883/6230 KB   
5887/6230 KB   
5891/6230 KB   
5895/6230 KB   
5899/6230 KB   
5903/6230 KB   
5907/6230 KB   
5911/6230 KB   
5915/6230 KB   
5919/6230 KB   
5923/6230 KB   
5927/6230 KB   
5931/6230 KB   
5935/6230 KB   
5939/6230 KB   
5943/6230 KB   
5947/6230 KB   
5951/6230 KB   
5955/6230 KB   
5959/6230 KB   
5963/6230 KB   
5967/6230 KB   
5971/6230 KB   
5975/6230 KB   
5979/6230 KB   
5983/6230 KB   
5987/6230 KB   
5991/6230 KB   
5995/6230 KB   
5999/6230 KB   
6003/6230 KB   
6007/6230 KB   
6011/6230 KB   
6015/6230 KB   
6019/6230 KB   
6023/6230 KB   
6027/6230 KB   
6031/6230 KB   
6035/6230 KB   
6039/6230 KB   
6043/6230 KB   
6047/6230 KB   
6051/6230 KB   
6055/6230 KB   
6059/6230 KB   
6063/6230 KB   
6067/6230 KB   
6071/6230 KB   
6075/6230 KB   
6079/6230 KB   
6083/6230 KB   
6087/6230 KB   
6091/6230 KB   
6095/6230 KB   
6099/6230 KB   
6103/6230 KB   
6107/6230 KB   
6111/6230 KB   
6115/6230 KB   
6119/6230 KB   
6123/6230 KB   
6127/6230 KB   
6131/6230 KB   
6135/6230 KB   
6139/6230 KB   
6143/6230 KB   
6147/6230 KB   
6151/6230 KB   
6155/6230 KB   
6159/6230 KB   
6163/6230 KB   
6167/6230 KB   
6171/6230 KB   
6175/6230 KB   
6179/6230 KB   
6183/6230 KB   
6187/6230 KB   
6191/6230 KB   
6195/6230 KB   
6199/6230 KB   
6203/6230 KB   
6207/6230 KB   
6211/6230 KB   
6215/6230 KB   
6219/6230 KB   
6223/6230 KB   
6227/6230 KB   
6230/6230 KB   
               
Downloaded: http://repo.maven.apache.org/maven2/org/codehaus/groovy/groovy-all/2.1.8/groovy-all-2.1.8.jar
(6230 KB at 20627.8 KB/sec)
[INFO] 
[INFO] --- maven-install-plugin:2.3:install (default-install) @ stacks-common ---
Downloading: http://repo.maven.apache.org/maven2/org/codehaus/plexus/plexus-utils/1.5.6/plexus-utils-1.5.6.pom
4/6 KB         
6/6 KB   
         
Downloaded: http://repo.maven.apache.org/maven2/org/codehaus/plexus/plexus-utils/1.5.6/plexus-utils-1.5.6.pom
(6 KB at 246.6 KB/sec)
Downloading: http://repo.maven.apache.org/maven2/org/codehaus/plexus/plexus/1.0.12/plexus-1.0.12.pom
4/10 KB   
8/10 KB   
10/10 KB   
           
Downloaded: http://repo.maven.apache.org/maven2/org/codehaus/plexus/plexus/1.0.12/plexus-1.0.12.pom
(10 KB at 455.7 KB/sec)
Downloading: http://repo.maven.apache.org/maven2/org/codehaus/plexus/plexus-digest/1.0/plexus-digest-1.0.pom
2/2 KB     
         
Downloaded: http://repo.maven.apache.org/maven2/org/codehaus/plexus/plexus-digest/1.0/plexus-digest-1.0.pom
(2 KB at 51.7 KB/sec)
Downloading: http://repo.maven.apache.org/maven2/org/codehaus/plexus/plexus-components/1.1.7/plexus-components-1.1.7.pom
4/5 KB   
5/5 KB   
         
Downloaded: http://repo.maven.apache.org/maven2/org/codehaus/plexus/plexus-components/1.1.7/plexus-components-1.1.7.pom
(5 KB at 242.9 KB/sec)
Downloading: http://repo.maven.apache.org/maven2/org/codehaus/plexus/plexus-utils/1.5.6/plexus-utils-1.5.6.jar
Downloading: http://repo.maven.apache.org/maven2/org/codehaus/plexus/plexus-digest/1.0/plexus-digest-1.0.jar
4/245 KB   
8/245 KB   
12/245 KB   
16/245 KB   
20/245 KB   
24/245 KB   
28/245 KB   
32/245 KB   
36/245 KB   
40/245 KB   
44/245 KB   
48/245 KB   
52/245 KB   
56/245 KB   
60/245 KB   
64/245 KB   
68/245 KB   
72/245 KB   
76/245 KB   
80/245 KB   
84/245 KB   
88/245 KB   
88/245 KB   4/12 KB   
92/245 KB   4/12 KB   
96/245 KB   4/12 KB   
96/245 KB   8/12 KB   
100/245 KB   8/12 KB   
100/245 KB   12/12 KB   
104/245 KB   12/12 KB   
108/245 KB   12/12 KB   
112/245 KB   12/12 KB   
116/245 KB   12/12 KB   
120/245 KB   12/12 KB   
124/245 KB   12/12 KB   
128/245 KB   12/12 KB   
132/245 KB   12/12 KB   
136/245 KB   12/12 KB   
140/245 KB   12/12 KB   
144/245 KB   12/12 KB   
148/245 KB   12/12 KB   
152/245 KB   12/12 KB   
156/245 KB   12/12 KB   
160/245 KB   12/12 KB   
164/245 KB   12/12 KB   
168/245 KB   12/12 KB   
172/245 KB   12/12 KB   
176/245 KB   12/12 KB   
180/245 KB   12/12 KB   
184/245 KB   12/12 KB   
188/245 KB   12/12 KB   
192/245 KB   12/12 KB   
196/245 KB   12/12 KB   
200/245 KB   12/12 KB   
204/245 KB   12/12 KB   
208/245 KB   12/12 KB   
212/245 KB   12/12 KB   
216/245 KB   12/12 KB   
220/245 KB   12/12 KB   
224/245 KB   12/12 KB   
228/245 KB   12/12 KB   
232/245 KB   12/12 KB   
236/245 KB   12/12 KB   
240/245 KB   12/12 KB   
244/245 KB   12/12 KB   
245/245 KB   12/12 KB   
                        
Downloaded: http://repo.maven.apache.org/maven2/org/codehaus/plexus/plexus-digest/1.0/plexus-digest-1.0.jar
(12 KB at 463.2 KB/sec)
                        
Downloaded: http://repo.maven.apache.org/maven2/org/codehaus/plexus/plexus-utils/1.5.6/plexus-utils-1.5.6.jar
(245 KB at 8437.0 KB/sec)
[INFO] Installing <https://builds.apache.org/job/Bigtop-trunk-test-execution/ws/bigtop-tests/test-execution/common/pom.xml>
to /home/jenkins/.m2/repository/org/apache/bigtop/itest/stacks-common/1.1.0-SNAPSHOT/stacks-common-1.1.0-SNAPSHOT.pom
[INFO] 
[INFO] --- maven-deploy-plugin:2.5:deploy (default-deploy) @ stacks-common ---
Downloading: https://repository.apache.org/content/repositories/snapshots/org/apache/bigtop/itest/stacks-common/1.1.0-SNAPSHOT/maven-metadata.xml
                        
[WARNING] Could not transfer metadata org.apache.bigtop.itest:stacks-common:1.1.0-SNAPSHOT/maven-metadata.xml
from/to apache.snapshots.https (https://repository.apache.org/content/repositories/snapshots):
java.lang.RuntimeException: Could not generate DH keypair
[INFO] ------------------------------------------------------------------------
[INFO] Reactor Summary:
[INFO] 
[INFO] stacks-validation-common .......................... FAILURE [6.773s]
[INFO] smoke-tests-conf .................................. SKIPPED
[INFO] packagesmokes ..................................... SKIPPED
[INFO] bigtop-smokes ..................................... SKIPPED
[INFO] ------------------------------------------------------------------------
[INFO] BUILD FAILURE
[INFO] ------------------------------------------------------------------------
[INFO] Total time: 7.306s
[INFO] Finished at: Wed Oct 14 20:01:25 UTC 2015
[INFO] Final Memory: 8M/103M
[INFO] ------------------------------------------------------------------------
[ERROR] Failed to execute goal org.apache.maven.plugins:maven-deploy-plugin:2.5:deploy (default-deploy)
on project stacks-common: Failed to retrieve remote metadata org.apache.bigtop.itest:stacks-common:1.1.0-SNAPSHOT/maven-metadata.xml:
Could not transfer metadata org.apache.bigtop.itest:stacks-common:1.1.0-SNAPSHOT/maven-metadata.xml
from/to apache.snapshots.https (https://repository.apache.org/content/repositories/snapshots):
java.lang.RuntimeException: Could not generate DH keypair: Prime size must be multiple of
64, and can only range from 512 to 1024 (inclusive) -> [Help 1]
[ERROR] 
[ERROR] To see the full stack trace of the errors, re-run Maven with the -e switch.
[ERROR] Re-run Maven using the -X switch to enable full debug logging.
[ERROR] 
[ERROR] For more information about the errors and possible solutions, please read the following
articles:
[ERROR] [Help 1] http://cwiki.apache.org/confluence/display/MAVEN/MojoExecutionException
Build step 'Execute shell' marked build as failure

Mime
View raw message