bigtop-ci mailing list archives

Site index · List index
Message view « Date » · « Thread »
Top « Date » · « Thread »
From Apache Jenkins Server <jenk...@builds.apache.org>
Subject Build failed in Jenkins: Bigtop-trunk-iTest » iTest: system and integration testing in the cloud #2378
Date Thu, 22 Oct 2015 18:56:03 GMT
See <https://builds.apache.org/job/Bigtop-trunk-iTest/org.apache.bigtop.itest$itest-common/2378/>

------------------------------------------
[...truncated 806 lines...]
Downloaded: http://repo.maven.apache.org/maven2/org/apache/maven/shared/maven-common-artifact-filters/1.3/maven-common-artifact-filters-1.3.jar
(31 KB at 758.3 KB/sec)
Downloaded: http://repo.maven.apache.org/maven2/org/apache/maven/surefire/maven-surefire-common/2.7/maven-surefire-common-2.7.jar
(56 KB at 1104.1 KB/sec)
Downloaded: http://repo.maven.apache.org/maven2/org/apache/maven/surefire/surefire-api/2.7/surefire-api-2.7.jar
(126 KB at 2319.6 KB/sec)
[INFO] Surefire report directory: <https://builds.apache.org/job/Bigtop-trunk-iTest/org.apache.bigtop.itest$itest-common/ws/target/surefire-reports>
Downloading: http://repo.maven.apache.org/maven2/org/apache/maven/surefire/surefire-junit4/2.7/surefire-junit4-2.7.pom
Downloaded: http://repo.maven.apache.org/maven2/org/apache/maven/surefire/surefire-junit4/2.7/surefire-junit4-2.7.pom
(3 KB at 43.8 KB/sec)
Downloading: http://repo.maven.apache.org/maven2/org/apache/maven/surefire/surefire-providers/2.7/surefire-providers-2.7.pom
Downloaded: http://repo.maven.apache.org/maven2/org/apache/maven/surefire/surefire-providers/2.7/surefire-providers-2.7.pom
(2 KB at 41.8 KB/sec)
Downloading: http://repo.maven.apache.org/maven2/org/apache/maven/surefire/surefire-junit4/2.7/surefire-junit4-2.7.jar
Downloaded: http://repo.maven.apache.org/maven2/org/apache/maven/surefire/surefire-junit4/2.7/surefire-junit4-2.7.jar
(18 KB at 416.9 KB/sec)

-------------------------------------------------------
 T E S T S
-------------------------------------------------------
Running org.apache.bigtop.itest.shell.ShellTest
Tests run: 2, Failures: 0, Errors: 0, Skipped: 1, Time elapsed: 0.732 sec
Running org.apache.bigtop.itest.TestListUtilsTest
Tests run: 1, Failures: 0, Errors: 0, Skipped: 0, Time elapsed: 0.058 sec
Running org.apache.bigtop.itest.JUnitUtilsTest
Disclaimer: This test expected to show a failure in an embeded testcase
    [junit] Running org.apache.bigtop.itest.DummyTestPassTests run: 1, Failures: 0, Errors:
0, Time elapsed: 0.383 secRunning org.apache.bigtop.itest.DummyTestFailTests run: 1, Failures:
1, Errors: 0, Time elapsed: 0.158 secTEST org.apache.bigtop.itest.DummyTestFail FAILED
    [junit] Tests FAILED
Disclaimer: This test expected to show an error in an embeded testcase
    [junit] Running org.apache.bigtop.itest.DummyTestErrorTests run: 1, Failures: 0, Errors:
1, Time elapsed: 0.361 sec
    [junit] Test org.apache.bigtop.itest.DummyTestError FAILED
    [junit] Running org.apache.bigtop.itest.DummyTestPass
    [junit] Tests run: 1, Failures: 0, Errors: 0, Time elapsed: 0.34 sec
    [junit] Running org.apache.bigtop.itest.DummyTestPass
    [junit] Tests run: 1, Failures: 0, Errors: 0, Time elapsed: 0.337 sec
Tests run: 4, Failures: 0, Errors: 0, Skipped: 0, Time elapsed: 5.575 sec
Running org.apache.bigtop.itest.JarContentTest
log4j:WARN No appenders could be found for logger (org.apache.bigtop.itest.JarContent).
log4j:WARN Please initialize the log4j system properly.
Tests run: 6, Failures: 0, Errors: 0, Skipped: 0, Time elapsed: 1.199 sec
Running org.apache.bigtop.itest.TestContractJavaProc
Tests run: 2, Failures: 0, Errors: 0, Skipped: 0, Time elapsed: 0.004 sec
Running org.apache.bigtop.itest.posix.UGITest
Tests run: 2, Failures: 0, Errors: 0, Skipped: 0, Time elapsed: 0.037 sec
Running org.apache.bigtop.itest.posix.ServiceTest
Status []
Tests run: 2, Failures: 0, Errors: 0, Skipped: 1, Time elapsed: 0.08 sec
Running org.apache.bigtop.itest.posix.AlternativeTest
Tests run: 1, Failures: 0, Errors: 0, Skipped: 0, Time elapsed: 1.268 sec
Running org.apache.bigtop.itest.TestContractJava
Tests run: 2, Failures: 0, Errors: 0, Skipped: 0, Time elapsed: 0.002 sec
Running org.apache.bigtop.itest.pmanager.PackageManagerTest
/etc/cron.monthly/.placeholder
/etc/cron.hourly/.placeholder
/etc/default/cron
/etc/cron.weekly/.placeholder
/etc/cron.d/.placeholder
/etc/cron.daily/.placeholder
/etc/pam.d/cron
/etc/init/cron.conf
/etc/crontab
/.
/etc
/etc/cron.monthly
/etc/cron.monthly/.placeholder
/etc/cron.hourly
/etc/cron.hourly/.placeholder
/etc/default
/etc/default/cron
/etc/cron.weekly
/etc/cron.weekly/.placeholder
/etc/cron.d
/etc/cron.d/.placeholder
/etc/cron.daily
/etc/cron.daily/.placeholder
/etc/pam.d
/etc/pam.d/cron
/etc/init
/etc/init/cron.conf
/etc/init.d
/etc/crontab
/usr
/usr/share
/usr/share/bug
/usr/share/bug/cron
/usr/share/bug/cron/script
/usr/share/bug/cron/control
/usr/share/man
/usr/share/man/man1
/usr/share/man/man1/crontab.1.gz
/usr/share/man/man5
/usr/share/man/man5/crontab.5.gz
/usr/share/man/man8
/usr/share/man/man8/cron.8.gz
/usr/share/doc
/usr/share/doc/cron
/usr/share/doc/cron/README
/usr/share/doc/cron/README.anacron
/usr/share/doc/cron/README.Debian
/usr/share/doc/cron/FEATURES
/usr/share/doc/cron/copyright
/usr/share/doc/cron/examples
/usr/share/doc/cron/examples/crontab2english.pl
/usr/share/doc/cron/examples/cron-stats.pl
/usr/share/doc/cron/examples/cron-tasks-review.sh
/usr/share/doc/cron/NEWS.Debian.gz
/usr/share/doc/cron/changelog.Debian.gz
/usr/share/doc/cron/THANKS
/usr/share/doc/cron/TODO.Debian
/usr/sbin
/usr/sbin/cron
/usr/bin
/usr/bin/crontab
/var
/var/spool
/var/spool/cron
/var/spool/cron/crontabs
/etc/init.d/cron
Tests run: 11, Failures: 0, Errors: 0, Skipped: 3, Time elapsed: 12.962 sec
Running org.apache.bigtop.itest.junit.OrderedParameterizedTest
Tests run: 3, Failures: 0, Errors: 0, Skipped: 0, Time elapsed: 0.034 sec
Running org.apache.bigtop.itest.junit.OrderedTest
Tests run: 3, Failures: 0, Errors: 0, Skipped: 0, Time elapsed: 0.006 sec
Running org.apache.bigtop.itest.TestContractGroovy
Tests run: 2, Failures: 0, Errors: 0, Skipped: 0, Time elapsed: 0.008 sec

Results :

Tests run: 41, Failures: 0, Errors: 0, Skipped: 5

[JENKINS] Recording test results
log4j:WARN No appenders could be found for logger (org.apache.commons.beanutils.converters.BooleanConverter).
log4j:WARN Please initialize the log4j system properly.
[INFO] 
[INFO] --- maven-jar-plugin:2.2:jar (default-jar) @ itest-common ---
Downloading: http://repo.maven.apache.org/maven2/org/apache/maven/maven-project/2.0.7/maven-project-2.0.7.pom
Downloaded: http://repo.maven.apache.org/maven2/org/apache/maven/maven-project/2.0.7/maven-project-2.0.7.pom
(3 KB at 71.5 KB/sec)
Downloading: http://repo.maven.apache.org/maven2/org/apache/maven/maven/2.0.7/maven-2.0.7.pom
Downloaded: http://repo.maven.apache.org/maven2/org/apache/maven/maven/2.0.7/maven-2.0.7.pom
(11 KB at 286.5 KB/sec)
Downloading: http://repo.maven.apache.org/maven2/org/apache/maven/maven-settings/2.0.7/maven-settings-2.0.7.pom
Downloaded: http://repo.maven.apache.org/maven2/org/apache/maven/maven-settings/2.0.7/maven-settings-2.0.7.pom
(2 KB at 52.8 KB/sec)
Downloading: http://repo.maven.apache.org/maven2/org/apache/maven/maven-model/2.0.7/maven-model-2.0.7.pom
Downloaded: http://repo.maven.apache.org/maven2/org/apache/maven/maven-model/2.0.7/maven-model-2.0.7.pom
(3 KB at 85.0 KB/sec)
Downloading: http://repo.maven.apache.org/maven2/org/apache/maven/maven-profile/2.0.7/maven-profile-2.0.7.pom
Downloaded: http://repo.maven.apache.org/maven2/org/apache/maven/maven-profile/2.0.7/maven-profile-2.0.7.pom
(2 KB at 53.7 KB/sec)
Downloading: http://repo.maven.apache.org/maven2/org/apache/maven/maven-artifact-manager/2.0.7/maven-artifact-manager-2.0.7.pom
Downloaded: http://repo.maven.apache.org/maven2/org/apache/maven/maven-artifact-manager/2.0.7/maven-artifact-manager-2.0.7.pom
(3 KB at 71.1 KB/sec)
Downloading: http://repo.maven.apache.org/maven2/org/apache/maven/maven-repository-metadata/2.0.7/maven-repository-metadata-2.0.7.pom
Downloaded: http://repo.maven.apache.org/maven2/org/apache/maven/maven-repository-metadata/2.0.7/maven-repository-metadata-2.0.7.pom
(2 KB at 45.2 KB/sec)
Downloading: http://repo.maven.apache.org/maven2/org/apache/maven/maven-artifact/2.0.7/maven-artifact-2.0.7.pom
Downloaded: http://repo.maven.apache.org/maven2/org/apache/maven/maven-artifact/2.0.7/maven-artifact-2.0.7.pom
(2 KB at 44.0 KB/sec)
Downloading: http://repo.maven.apache.org/maven2/org/apache/maven/maven-plugin-registry/2.0.7/maven-plugin-registry-2.0.7.pom
Downloaded: http://repo.maven.apache.org/maven2/org/apache/maven/maven-plugin-registry/2.0.7/maven-plugin-registry-2.0.7.pom
(2 KB at 54.3 KB/sec)
Downloading: http://repo.maven.apache.org/maven2/org/apache/maven/maven-archiver/2.3/maven-archiver-2.3.pom
Downloaded: http://repo.maven.apache.org/maven2/org/apache/maven/maven-archiver/2.3/maven-archiver-2.3.pom
(4 KB at 96.4 KB/sec)
Downloading: http://repo.maven.apache.org/maven2/org/codehaus/plexus/plexus-archiver/1.0-alpha-9/plexus-archiver-1.0-alpha-9.pom
Downloaded: http://repo.maven.apache.org/maven2/org/codehaus/plexus/plexus-archiver/1.0-alpha-9/plexus-archiver-1.0-alpha-9.pom
(2 KB at 48.8 KB/sec)
Downloading: http://repo.maven.apache.org/maven2/org/codehaus/plexus/plexus-container-default/1.0-alpha-15/plexus-container-default-1.0-alpha-15.pom
Downloaded: http://repo.maven.apache.org/maven2/org/codehaus/plexus/plexus-container-default/1.0-alpha-15/plexus-container-default-1.0-alpha-15.pom
(2 KB at 47.7 KB/sec)
Downloading: http://repo.maven.apache.org/maven2/org/codehaus/plexus/plexus-containers/1.0-alpha-15/plexus-containers-1.0-alpha-15.pom
Downloaded: http://repo.maven.apache.org/maven2/org/codehaus/plexus/plexus-containers/1.0-alpha-15/plexus-containers-1.0-alpha-15.pom
(2 KB at 54.3 KB/sec)
Downloading: http://repo.maven.apache.org/maven2/org/codehaus/plexus/plexus/1.0.9/plexus-1.0.9.pom
Downloaded: http://repo.maven.apache.org/maven2/org/codehaus/plexus/plexus/1.0.9/plexus-1.0.9.pom
(8 KB at 208.3 KB/sec)
Downloading: http://repo.maven.apache.org/maven2/org/codehaus/plexus/plexus-component-api/1.0-alpha-15/plexus-component-api-1.0-alpha-15.pom
Downloaded: http://repo.maven.apache.org/maven2/org/codehaus/plexus/plexus-component-api/1.0-alpha-15/plexus-component-api-1.0-alpha-15.pom
(948 B at 23.7 KB/sec)
Downloading: http://repo.maven.apache.org/maven2/org/codehaus/plexus/plexus-classworlds/1.2-alpha-6/plexus-classworlds-1.2-alpha-6.pom
Downloaded: http://repo.maven.apache.org/maven2/org/codehaus/plexus/plexus-classworlds/1.2-alpha-6/plexus-classworlds-1.2-alpha-6.pom
(3 KB at 59.4 KB/sec)
Downloading: http://repo.maven.apache.org/maven2/org/codehaus/plexus/plexus-utils/1.3/plexus-utils-1.3.pom
Downloaded: http://repo.maven.apache.org/maven2/org/codehaus/plexus/plexus-utils/1.3/plexus-utils-1.3.pom
(2 KB at 25.9 KB/sec)
Downloading: http://repo.maven.apache.org/maven2/org/codehaus/plexus/plexus-io/1.0-alpha-1/plexus-io-1.0-alpha-1.pom
Downloaded: http://repo.maven.apache.org/maven2/org/codehaus/plexus/plexus-io/1.0-alpha-1/plexus-io-1.0-alpha-1.pom
(2 KB at 32.2 KB/sec)
Downloading: http://repo.maven.apache.org/maven2/org/codehaus/plexus/plexus-component-api/1.0-alpha-16/plexus-component-api-1.0-alpha-16.pom
Downloaded: http://repo.maven.apache.org/maven2/org/codehaus/plexus/plexus-component-api/1.0-alpha-16/plexus-component-api-1.0-alpha-16.pom
(3 KB at 56.9 KB/sec)
Downloading: http://repo.maven.apache.org/maven2/org/codehaus/plexus/plexus-containers/1.0-alpha-16/plexus-containers-1.0-alpha-16.pom
Downloaded: http://repo.maven.apache.org/maven2/org/codehaus/plexus/plexus-containers/1.0-alpha-16/plexus-containers-1.0-alpha-16.pom
(2 KB at 48.4 KB/sec)
Downloading: http://repo.maven.apache.org/maven2/org/codehaus/plexus/plexus-classworlds/1.2-alpha-7/plexus-classworlds-1.2-alpha-7.pom
Downloaded: http://repo.maven.apache.org/maven2/org/codehaus/plexus/plexus-classworlds/1.2-alpha-7/plexus-classworlds-1.2-alpha-7.pom
(3 KB at 61.0 KB/sec)
Downloading: http://repo.maven.apache.org/maven2/org/codehaus/plexus/plexus-utils/1.4.9/plexus-utils-1.4.9.pom
Downloaded: http://repo.maven.apache.org/maven2/org/codehaus/plexus/plexus-utils/1.4.9/plexus-utils-1.4.9.pom
(3 KB at 57.5 KB/sec)
Downloading: http://repo.maven.apache.org/maven2/commons-lang/commons-lang/2.1/commons-lang-2.1.pom
Downloaded: http://repo.maven.apache.org/maven2/commons-lang/commons-lang/2.1/commons-lang-2.1.pom
(10 KB at 248.6 KB/sec)
Downloading: http://repo.maven.apache.org/maven2/org/apache/maven/maven-archiver/2.3/maven-archiver-2.3.jar
Downloading: http://repo.maven.apache.org/maven2/org/codehaus/plexus/plexus-archiver/1.0-alpha-9/plexus-archiver-1.0-alpha-9.jar
Downloading: http://repo.maven.apache.org/maven2/org/codehaus/plexus/plexus-io/1.0-alpha-1/plexus-io-1.0-alpha-1.jar
Downloading: http://repo.maven.apache.org/maven2/commons-lang/commons-lang/2.1/commons-lang-2.1.jar
Downloading: http://repo.maven.apache.org/maven2/org/codehaus/plexus/plexus-utils/1.4.9/plexus-utils-1.4.9.jar
Downloaded: http://repo.maven.apache.org/maven2/org/apache/maven/maven-archiver/2.3/maven-archiver-2.3.jar
(18 KB at 444.3 KB/sec)
Downloaded: http://repo.maven.apache.org/maven2/org/codehaus/plexus/plexus-io/1.0-alpha-1/plexus-io-1.0-alpha-1.jar
(12 KB at 277.8 KB/sec)
Downloaded: http://repo.maven.apache.org/maven2/org/codehaus/plexus/plexus-archiver/1.0-alpha-9/plexus-archiver-1.0-alpha-9.jar
(154 KB at 3486.2 KB/sec)
Downloaded: http://repo.maven.apache.org/maven2/commons-lang/commons-lang/2.1/commons-lang-2.1.jar
(203 KB at 3497.5 KB/sec)
Downloaded: http://repo.maven.apache.org/maven2/org/codehaus/plexus/plexus-utils/1.4.9/plexus-utils-1.4.9.jar
(200 KB at 3320.6 KB/sec)
[INFO] Building jar: <https://builds.apache.org/job/Bigtop-trunk-iTest/org.apache.bigtop.itest$itest-common/ws/target/itest-common-1.1.0-SNAPSHOT.jar>
[INFO] 
[INFO] --- maven-jar-plugin:2.2:test-jar (default) @ itest-common ---
[INFO] Building jar: <https://builds.apache.org/job/Bigtop-trunk-iTest/org.apache.bigtop.itest$itest-common/ws/target/itest-common-1.1.0-SNAPSHOT-tests.jar>
[INFO] 
[INFO] --- maven-failsafe-plugin:2.17:verify (default) @ itest-common ---
Downloading: http://repo.maven.apache.org/maven2/org/apache/maven/surefire/maven-surefire-common/2.17/maven-surefire-common-2.17.pom
Downloaded: http://repo.maven.apache.org/maven2/org/apache/maven/surefire/maven-surefire-common/2.17/maven-surefire-common-2.17.pom
(6 KB at 152.7 KB/sec)
Downloading: http://repo.maven.apache.org/maven2/org/apache/maven/plugin-tools/maven-plugin-annotations/3.2/maven-plugin-annotations-3.2.pom
Downloaded: http://repo.maven.apache.org/maven2/org/apache/maven/plugin-tools/maven-plugin-annotations/3.2/maven-plugin-annotations-3.2.pom
(2 KB at 39.6 KB/sec)
Downloading: http://repo.maven.apache.org/maven2/org/apache/maven/plugin-tools/maven-plugin-tools/3.2/maven-plugin-tools-3.2.pom
Downloaded: http://repo.maven.apache.org/maven2/org/apache/maven/plugin-tools/maven-plugin-tools/3.2/maven-plugin-tools-3.2.pom
(17 KB at 413.9 KB/sec)
Downloading: http://repo.maven.apache.org/maven2/org/apache/maven/surefire/surefire-api/2.17/surefire-api-2.17.pom
Downloaded: http://repo.maven.apache.org/maven2/org/apache/maven/surefire/surefire-api/2.17/surefire-api-2.17.pom
(3 KB at 57.4 KB/sec)
Downloading: http://repo.maven.apache.org/maven2/org/apache/maven/surefire/surefire-booter/2.17/surefire-booter-2.17.pom
Downloaded: http://repo.maven.apache.org/maven2/org/apache/maven/surefire/surefire-booter/2.17/surefire-booter-2.17.pom
(3 KB at 70.9 KB/sec)
Downloading: http://repo.maven.apache.org/maven2/org/apache/commons/commons-lang3/3.1/commons-lang3-3.1.pom
Downloaded: http://repo.maven.apache.org/maven2/org/apache/commons/commons-lang3/3.1/commons-lang3-3.1.pom
(17 KB at 408.0 KB/sec)
Downloading: http://repo.maven.apache.org/maven2/org/apache/commons/commons-parent/22/commons-parent-22.pom
Downloaded: http://repo.maven.apache.org/maven2/org/apache/commons/commons-parent/22/commons-parent-22.pom
(41 KB at 998.4 KB/sec)
Downloading: http://repo.maven.apache.org/maven2/org/apache/apache/9/apache-9.pom
Downloaded: http://repo.maven.apache.org/maven2/org/apache/apache/9/apache-9.pom (15 KB at
379.6 KB/sec)
Downloading: http://repo.maven.apache.org/maven2/org/apache/maven/surefire/maven-surefire-common/2.17/maven-surefire-common-2.17.jar
Downloading: http://repo.maven.apache.org/maven2/org/apache/maven/surefire/surefire-booter/2.17/surefire-booter-2.17.jar
Downloading: http://repo.maven.apache.org/maven2/org/apache/commons/commons-lang3/3.1/commons-lang3-3.1.jar
Downloading: http://repo.maven.apache.org/maven2/org/apache/maven/surefire/surefire-api/2.17/surefire-api-2.17.jar
Downloading: http://repo.maven.apache.org/maven2/org/apache/maven/plugin-tools/maven-plugin-annotations/3.2/maven-plugin-annotations-3.2.jar
Downloaded: http://repo.maven.apache.org/maven2/org/apache/maven/surefire/surefire-booter/2.17/surefire-booter-2.17.jar
(39 KB at 942.7 KB/sec)
Downloaded: http://repo.maven.apache.org/maven2/org/apache/maven/surefire/maven-surefire-common/2.17/maven-surefire-common-2.17.jar
(260 KB at 5634.1 KB/sec)
Downloaded: http://repo.maven.apache.org/maven2/org/apache/maven/plugin-tools/maven-plugin-annotations/3.2/maven-plugin-annotations-3.2.jar
(15 KB at 368.1 KB/sec)
Downloaded: http://repo.maven.apache.org/maven2/org/apache/maven/surefire/surefire-api/2.17/surefire-api-2.17.jar
(144 KB at 3345.5 KB/sec)
Downloaded: http://repo.maven.apache.org/maven2/org/apache/commons/commons-lang3/3.1/commons-lang3-3.1.jar
(309 KB at 5317.3 KB/sec)
[INFO] Tests are skipped.
[JENKINS] Recording test results
[INFO] 
[INFO] --- maven-install-plugin:2.3:install (default-install) @ itest-common ---
Downloading: http://repo.maven.apache.org/maven2/org/codehaus/plexus/plexus-digest/1.0/plexus-digest-1.0.pom
Downloaded: http://repo.maven.apache.org/maven2/org/codehaus/plexus/plexus-digest/1.0/plexus-digest-1.0.pom
(2 KB at 29.5 KB/sec)
Downloading: http://repo.maven.apache.org/maven2/org/codehaus/plexus/plexus-components/1.1.7/plexus-components-1.1.7.pom
Downloaded: http://repo.maven.apache.org/maven2/org/codehaus/plexus/plexus-components/1.1.7/plexus-components-1.1.7.pom
(5 KB at 138.8 KB/sec)
Downloading: http://repo.maven.apache.org/maven2/org/codehaus/plexus/plexus-digest/1.0/plexus-digest-1.0.jar
Downloaded: http://repo.maven.apache.org/maven2/org/codehaus/plexus/plexus-digest/1.0/plexus-digest-1.0.jar
(12 KB at 330.9 KB/sec)
[INFO] Installing <https://builds.apache.org/job/Bigtop-trunk-iTest/org.apache.bigtop.itest$itest-common/ws/target/itest-common-1.1.0-SNAPSHOT.jar>
to /jenkins/maven-repositories/0/org/apache/bigtop/itest/itest-common/1.1.0-SNAPSHOT/itest-common-1.1.0-SNAPSHOT.jar
[INFO] Installing <https://builds.apache.org/job/Bigtop-trunk-iTest/org.apache.bigtop.itest$itest-common/ws/pom.xml>
to /jenkins/maven-repositories/0/org/apache/bigtop/itest/itest-common/1.1.0-SNAPSHOT/itest-common-1.1.0-SNAPSHOT.pom
[INFO] Installing <https://builds.apache.org/job/Bigtop-trunk-iTest/org.apache.bigtop.itest$itest-common/ws/target/itest-common-1.1.0-SNAPSHOT-tests.jar>
to /jenkins/maven-repositories/0/org/apache/bigtop/itest/itest-common/1.1.0-SNAPSHOT/itest-common-1.1.0-SNAPSHOT-tests.jar
[INFO] 
[INFO] --- maven-deploy-plugin:2.5:deploy (default-deploy) @ itest-common ---
Downloading: https://repository.apache.org/content/repositories/snapshots/org/apache/bigtop/itest/itest-common/1.1.0-SNAPSHOT/maven-metadata.xml
[WARNING] Could not transfer metadata org.apache.bigtop.itest:itest-common:1.1.0-SNAPSHOT/maven-metadata.xml
from/to apache.snapshots.https (https://repository.apache.org/content/repositories/snapshots):
java.lang.RuntimeException: Could not generate DH keypair
[INFO] ------------------------------------------------------------------------
[INFO] BUILD FAILURE
[INFO] ------------------------------------------------------------------------
[INFO] Total time: 1:24.383s
[INFO] Finished at: Thu Oct 22 18:56:56 UTC 2015
[INFO] Final Memory: 16M/245M
[INFO] ------------------------------------------------------------------------
Waiting for Jenkins to finish collecting data[ERROR] Failed to execute goal org.apache.maven.plugins:maven-deploy-plugin:2.5:deploy
(default-deploy) on project itest-common: Failed to retrieve remote metadata org.apache.bigtop.itest:itest-common:1.1.0-SNAPSHOT/maven-metadata.xml:
Could not transfer metadata org.apache.bigtop.itest:itest-common:1.1.0-SNAPSHOT/maven-metadata.xml
from/to apache.snapshots.https (https://repository.apache.org/content/repositories/snapshots):
java.lang.RuntimeException: Could not generate DH keypair: Prime size must be multiple of
64, and can only range from 512 to 1024 (inclusive) -> [Help 1]
[ERROR] 
[ERROR] To see the full stack trace of the errors, re-run Maven with the -e switch.
[ERROR] Re-run Maven using the -X switch to enable full debug logging.
[ERROR] 
[ERROR] For more information about the errors and possible solutions, please read the following
articles:
[ERROR] [Help 1] http://cwiki.apache.org/confluence/display/MAVEN/MojoExecutionException


Mime
View raw message