bigtop-ci mailing list archives

Site index · List index
Message view « Date » · « Thread »
Top « Date » · « Thread »
From Apache Jenkins Server <jenk...@builds.apache.org>
Subject Build failed in Jenkins: Bigtop-trunk-iTest #2358
Date Tue, 22 Sep 2015 15:59:53 GMT
See <https://builds.apache.org/job/Bigtop-trunk-iTest/2358/changes>

Changes:

[evansye] BIGTOP-2065. Update deployment README.md to reflect on better deployment experience

------------------------------------------
[...truncated 248 lines...]
Downloaded: http://repo.maven.apache.org/maven2/org/codehaus/groovy/groovy-all/2.1.8/groovy-all-2.1.8.jar
(6230 KB at 41809.3 KB/sec)
[INFO] 
[INFO] --- maven-clean-plugin:2.4.1:clean (default-clean) @ itest-common ---
[INFO] 
[INFO] --- groovy-eclipse-compiler:2.8.0-01:add-groovy-build-paths (default-add-groovy-build-paths)
@ itest-common ---
[WARNING] Failure to transfer org.codehaus.groovy:groovy-eclipse-batch/maven-metadata.xml
from http://repository.codehaus.org was cached in the local repository, resolution will not
be reattempted until the update interval of codehaus.org has elapsed or updates are forced.
Original error: Could not transfer metadata org.codehaus.groovy:groovy-eclipse-batch/maven-metadata.xml
from/to codehaus.org (http://repository.codehaus.org): repository.codehaus.org
[WARNING] Failure to transfer org.codehaus.groovy:groovy-eclipse-batch/maven-metadata.xml
from http://nexus.codehaus.org/snapshots/ was cached in the local repository, resolution will
not be reattempted until the update interval of codehaus-snapshots has elapsed or updates
are forced. Original error: Could not transfer metadata org.codehaus.groovy:groovy-eclipse-batch/maven-metadata.xml
from/to codehaus-snapshots (http://nexus.codehaus.org/snapshots/): nexus.codehaus.org
[INFO] Adding /src/main/groovy to the list of source folders
[INFO] Adding /src/test/groovy to the list of test source folders
[INFO] 
[INFO] --- maven-remote-resources-plugin:1.1:process (default) @ itest-common ---
[INFO] Setting property: classpath.resource.loader.class => 'org.codehaus.plexus.velocity.ContextClassLoaderResourceLoader'.
[INFO] Setting property: velocimacro.messages.on => 'false'.
[INFO] Setting property: resource.loader => 'classpath'.
[INFO] Setting property: resource.manager.logwhenfound => 'false'.
[INFO] 
[INFO] --- maven-resources-plugin:2.4:resources (default-resources) @ itest-common ---
[INFO] Using 'UTF-8' encoding to copy filtered resources.
[INFO] skip non existing resourceDirectory <https://builds.apache.org/job/Bigtop-trunk-iTest/ws/bigtop-test-framework/src/main/resources>
[INFO] Copying 3 resources
[INFO] 
[INFO] --- maven-compiler-plugin:3.1:compile (default-compile) @ itest-common ---
Downloading: http://repo.maven.apache.org/maven2/org/codehaus/groovy/groovy-eclipse-batch/2.1.8-01/groovy-eclipse-batch-2.1.8-01.jar
Downloaded: http://repo.maven.apache.org/maven2/org/codehaus/groovy/groovy-eclipse-batch/2.1.8-01/groovy-eclipse-batch-2.1.8-01.jar
(13908 KB at 40904.3 KB/sec)
[INFO] Changes detected - recompiling the module!
[INFO] Using Groovy-Eclipse compiler to compile both Java and Groovy files
[INFO] 
[INFO] --- maven-resources-plugin:2.4:testResources (default-testResources) @ itest-common
---
[INFO] Using 'UTF-8' encoding to copy filtered resources.
[INFO] skip non existing resourceDirectory <https://builds.apache.org/job/Bigtop-trunk-iTest/ws/bigtop-test-framework/src/test/resources>
[INFO] Copying 3 resources
[INFO] 
[INFO] --- maven-compiler-plugin:3.1:testCompile (default-testCompile) @ itest-common ---
[INFO] Changes detected - recompiling the module!
[INFO] Using Groovy-Eclipse compiler to compile both Java and Groovy files
[INFO] 
[INFO] --- maven-surefire-plugin:2.7:test (default-test) @ itest-common ---
Downloading: http://repo.maven.apache.org/maven2/org/apache/maven/surefire/surefire-booter/2.7/surefire-booter-2.7.pom
Downloaded: http://repo.maven.apache.org/maven2/org/apache/maven/surefire/surefire-booter/2.7/surefire-booter-2.7.pom
(2 KB at 194.4 KB/sec)
Downloading: http://repo.maven.apache.org/maven2/org/apache/maven/surefire/surefire-api/2.7/surefire-api-2.7.pom
Downloaded: http://repo.maven.apache.org/maven2/org/apache/maven/surefire/surefire-api/2.7/surefire-api-2.7.pom
(2 KB at 213.0 KB/sec)
Downloading: http://repo.maven.apache.org/maven2/org/apache/maven/surefire/maven-surefire-common/2.7/maven-surefire-common-2.7.pom
Downloaded: http://repo.maven.apache.org/maven2/org/apache/maven/surefire/maven-surefire-common/2.7/maven-surefire-common-2.7.pom
(4 KB at 414.5 KB/sec)
Downloading: http://repo.maven.apache.org/maven2/org/apache/maven/surefire/surefire-booter/2.7/surefire-booter-2.7.jar
Downloading: http://repo.maven.apache.org/maven2/org/apache/maven/surefire/maven-surefire-common/2.7/maven-surefire-common-2.7.jar
Downloading: http://repo.maven.apache.org/maven2/org/apache/maven/surefire/surefire-api/2.7/surefire-api-2.7.jar
Downloaded: http://repo.maven.apache.org/maven2/org/apache/maven/surefire/surefire-api/2.7/surefire-api-2.7.jar
(126 KB at 9635.4 KB/sec)
Downloaded: http://repo.maven.apache.org/maven2/org/apache/maven/surefire/surefire-booter/2.7/surefire-booter-2.7.jar
(34 KB at 2068.8 KB/sec)
Downloaded: http://repo.maven.apache.org/maven2/org/apache/maven/surefire/maven-surefire-common/2.7/maven-surefire-common-2.7.jar
(56 KB at 3066.9 KB/sec)
[INFO] Surefire report directory: <https://builds.apache.org/job/Bigtop-trunk-iTest/ws/bigtop-test-framework/target/surefire-reports>
Downloading: http://repo.maven.apache.org/maven2/org/apache/maven/surefire/surefire-junit4/2.7/surefire-junit4-2.7.pom
Downloaded: http://repo.maven.apache.org/maven2/org/apache/maven/surefire/surefire-junit4/2.7/surefire-junit4-2.7.pom
(3 KB at 233.6 KB/sec)
Downloading: http://repo.maven.apache.org/maven2/org/apache/maven/surefire/surefire-providers/2.7/surefire-providers-2.7.pom
Downloaded: http://repo.maven.apache.org/maven2/org/apache/maven/surefire/surefire-providers/2.7/surefire-providers-2.7.pom
(2 KB at 171.6 KB/sec)
Downloading: http://repo.maven.apache.org/maven2/org/apache/maven/surefire/surefire-junit4/2.7/surefire-junit4-2.7.jar
Downloaded: http://repo.maven.apache.org/maven2/org/apache/maven/surefire/surefire-junit4/2.7/surefire-junit4-2.7.jar
(18 KB at 1945.6 KB/sec)

-------------------------------------------------------
 T E S T S
-------------------------------------------------------
Running org.apache.bigtop.itest.shell.ShellTest
Tests run: 2, Failures: 0, Errors: 0, Skipped: 1, Time elapsed: 0.736 sec
Running org.apache.bigtop.itest.TestListUtilsTest
Tests run: 1, Failures: 0, Errors: 0, Skipped: 0, Time elapsed: 0.059 sec
Running org.apache.bigtop.itest.JUnitUtilsTest
Disclaimer: This test expected to show a failure in an embeded testcase
    [junit] Running org.apache.bigtop.itest.DummyTestPassTests run: 1, Failures: 0, Errors:
0, Time elapsed: 0.374 secRunning org.apache.bigtop.itest.DummyTestFailTests run: 1, Failures:
1, Errors: 0, Time elapsed: 0.161 secTEST org.apache.bigtop.itest.DummyTestFail FAILED
    [junit] Tests FAILED
Disclaimer: This test expected to show an error in an embeded testcase
    [junit] Running org.apache.bigtop.itest.DummyTestError
    [junit] Tests run: 1, Failures: 0, Errors: 1, Time elapsed: 0.376 sec
    [junit] Test org.apache.bigtop.itest.DummyTestError FAILED
    [junit] Running org.apache.bigtop.itest.DummyTestPass
    [junit] Tests run: 1, Failures: 0, Errors: 0, Time elapsed: 0.337 sec
    [junit] Running org.apache.bigtop.itest.DummyTestPass
    [junit] Tests run: 1, Failures: 0, Errors: 0, Time elapsed: 0.337 sec
Tests run: 4, Failures: 0, Errors: 0, Skipped: 0, Time elapsed: 5.417 sec
Running org.apache.bigtop.itest.JarContentTest
log4j:WARN No appenders could be found for logger (org.apache.bigtop.itest.JarContent).
log4j:WARN Please initialize the log4j system properly.
Tests run: 6, Failures: 0, Errors: 0, Skipped: 0, Time elapsed: 1.163 sec
Running org.apache.bigtop.itest.TestContractJavaProc
Tests run: 2, Failures: 0, Errors: 0, Skipped: 0, Time elapsed: 0.003 sec
Running org.apache.bigtop.itest.posix.UGITest
Tests run: 2, Failures: 0, Errors: 0, Skipped: 0, Time elapsed: 0.036 sec
Running org.apache.bigtop.itest.posix.ServiceTest
Status []
Tests run: 2, Failures: 0, Errors: 0, Skipped: 1, Time elapsed: 0.322 sec
Running org.apache.bigtop.itest.posix.AlternativeTest
Tests run: 1, Failures: 0, Errors: 0, Skipped: 0, Time elapsed: 2.533 sec
Running org.apache.bigtop.itest.TestContractJava
Tests run: 2, Failures: 0, Errors: 0, Skipped: 0, Time elapsed: 0.002 sec
Running org.apache.bigtop.itest.pmanager.PackageManagerTest
/etc/cron.monthly/.placeholder
/etc/cron.hourly/.placeholder
/etc/default/cron
/etc/cron.weekly/.placeholder
/etc/cron.d/.placeholder
/etc/cron.daily/.placeholder
/etc/pam.d/cron
/etc/init/cron.conf
/etc/crontab
/.
/etc
/etc/cron.monthly
/etc/cron.monthly/.placeholder
/etc/cron.hourly
/etc/cron.hourly/.placeholder
/etc/default
/etc/default/cron
/etc/cron.weekly
/etc/cron.weekly/.placeholder
/etc/cron.d
/etc/cron.d/.placeholder
/etc/cron.daily
/etc/cron.daily/.placeholder
/etc/pam.d
/etc/pam.d/cron
/etc/init
/etc/init/cron.conf
/etc/init.d
/etc/crontab
/usr
/usr/share
/usr/share/bug
/usr/share/bug/cron
/usr/share/bug/cron/script
/usr/share/bug/cron/control
/usr/share/man
/usr/share/man/man1
/usr/share/man/man1/crontab.1.gz
/usr/share/man/man5
/usr/share/man/man5/crontab.5.gz
/usr/share/man/man8
/usr/share/man/man8/cron.8.gz
/usr/share/doc
/usr/share/doc/cron
/usr/share/doc/cron/README
/usr/share/doc/cron/README.anacron
/usr/share/doc/cron/README.Debian
/usr/share/doc/cron/FEATURES
/usr/share/doc/cron/copyright
/usr/share/doc/cron/examples
/usr/share/doc/cron/examples/crontab2english.pl
/usr/share/doc/cron/examples/cron-stats.pl
/usr/share/doc/cron/examples/cron-tasks-review.sh
/usr/share/doc/cron/NEWS.Debian.gz
/usr/share/doc/cron/changelog.Debian.gz
/usr/share/doc/cron/THANKS
/usr/share/doc/cron/TODO.Debian
/usr/sbin
/usr/sbin/cron
/usr/bin
/usr/bin/crontab
/var
/var/spool
/var/spool/cron
/var/spool/cron/crontabs
/etc/init.d/cron
Tests run: 11, Failures: 0, Errors: 0, Skipped: 3, Time elapsed: 6.005 sec
Running org.apache.bigtop.itest.junit.OrderedParameterizedTest
Tests run: 3, Failures: 0, Errors: 0, Skipped: 0, Time elapsed: 0.033 sec
Running org.apache.bigtop.itest.junit.OrderedTest
Tests run: 3, Failures: 0, Errors: 0, Skipped: 0, Time elapsed: 0.006 sec
Running org.apache.bigtop.itest.TestContractGroovy
Tests run: 2, Failures: 0, Errors: 0, Skipped: 0, Time elapsed: 0.007 sec

Results :

Tests run: 41, Failures: 0, Errors: 0, Skipped: 5

[JENKINS] Recording test results
log4j:WARN No appenders could be found for logger (org.apache.commons.beanutils.converters.BooleanConverter).
log4j:WARN Please initialize the log4j system properly.
[INFO] 
[INFO] --- maven-jar-plugin:2.2:jar (default-jar) @ itest-common ---
Downloading: http://repo.maven.apache.org/maven2/org/apache/maven/maven-archiver/2.3/maven-archiver-2.3.pom
Downloaded: http://repo.maven.apache.org/maven2/org/apache/maven/maven-archiver/2.3/maven-archiver-2.3.pom
(4 KB at 396.5 KB/sec)
Downloading: http://repo.maven.apache.org/maven2/org/codehaus/plexus/plexus-container-default/1.0-alpha-15/plexus-container-default-1.0-alpha-15.pom
Downloaded: http://repo.maven.apache.org/maven2/org/codehaus/plexus/plexus-container-default/1.0-alpha-15/plexus-container-default-1.0-alpha-15.pom
(2 KB at 185.3 KB/sec)
Downloading: http://repo.maven.apache.org/maven2/org/codehaus/plexus/plexus-containers/1.0-alpha-15/plexus-containers-1.0-alpha-15.pom
Downloaded: http://repo.maven.apache.org/maven2/org/codehaus/plexus/plexus-containers/1.0-alpha-15/plexus-containers-1.0-alpha-15.pom
(2 KB at 205.2 KB/sec)
Downloading: http://repo.maven.apache.org/maven2/org/codehaus/plexus/plexus-component-api/1.0-alpha-15/plexus-component-api-1.0-alpha-15.pom
Downloaded: http://repo.maven.apache.org/maven2/org/codehaus/plexus/plexus-component-api/1.0-alpha-15/plexus-component-api-1.0-alpha-15.pom
(948 B at 92.6 KB/sec)
Downloading: http://repo.maven.apache.org/maven2/org/codehaus/plexus/plexus-classworlds/1.2-alpha-6/plexus-classworlds-1.2-alpha-6.pom
Downloaded: http://repo.maven.apache.org/maven2/org/codehaus/plexus/plexus-classworlds/1.2-alpha-6/plexus-classworlds-1.2-alpha-6.pom
(3 KB at 289.6 KB/sec)
Downloading: http://repo.maven.apache.org/maven2/org/codehaus/plexus/plexus-component-api/1.0-alpha-16/plexus-component-api-1.0-alpha-16.pom
Downloaded: http://repo.maven.apache.org/maven2/org/codehaus/plexus/plexus-component-api/1.0-alpha-16/plexus-component-api-1.0-alpha-16.pom
(3 KB at 270.4 KB/sec)
Downloading: http://repo.maven.apache.org/maven2/org/codehaus/plexus/plexus-containers/1.0-alpha-16/plexus-containers-1.0-alpha-16.pom
Downloaded: http://repo.maven.apache.org/maven2/org/codehaus/plexus/plexus-containers/1.0-alpha-16/plexus-containers-1.0-alpha-16.pom
(2 KB at 204.5 KB/sec)
Downloading: http://repo.maven.apache.org/maven2/org/apache/maven/maven-archiver/2.3/maven-archiver-2.3.jar
Downloading: http://repo.maven.apache.org/maven2/org/codehaus/plexus/plexus-utils/1.4.9/plexus-utils-1.4.9.jar
Downloaded: http://repo.maven.apache.org/maven2/org/apache/maven/maven-archiver/2.3/maven-archiver-2.3.jar
(18 KB at 1732.6 KB/sec)
Downloaded: http://repo.maven.apache.org/maven2/org/codehaus/plexus/plexus-utils/1.4.9/plexus-utils-1.4.9.jar
(200 KB at 5108.5 KB/sec)
[INFO] Building jar: <https://builds.apache.org/job/Bigtop-trunk-iTest/ws/bigtop-test-framework/target/itest-common-1.1.0-SNAPSHOT.jar>
[INFO] 
[INFO] --- maven-jar-plugin:2.2:test-jar (default) @ itest-common ---
[INFO] Building jar: <https://builds.apache.org/job/Bigtop-trunk-iTest/ws/bigtop-test-framework/target/itest-common-1.1.0-SNAPSHOT-tests.jar>
[INFO] 
[INFO] --- maven-failsafe-plugin:2.17:verify (default) @ itest-common ---
Downloading: http://repo.maven.apache.org/maven2/org/apache/maven/surefire/maven-surefire-common/2.17/maven-surefire-common-2.17.pom
Downloaded: http://repo.maven.apache.org/maven2/org/apache/maven/surefire/maven-surefire-common/2.17/maven-surefire-common-2.17.pom
(6 KB at 496.2 KB/sec)
Downloading: http://repo.maven.apache.org/maven2/org/apache/maven/surefire/surefire-api/2.17/surefire-api-2.17.pom
Downloaded: http://repo.maven.apache.org/maven2/org/apache/maven/surefire/surefire-api/2.17/surefire-api-2.17.pom
(3 KB at 279.7 KB/sec)
Downloading: http://repo.maven.apache.org/maven2/org/apache/maven/surefire/surefire-booter/2.17/surefire-booter-2.17.pom
Downloaded: http://repo.maven.apache.org/maven2/org/apache/maven/surefire/surefire-booter/2.17/surefire-booter-2.17.pom
(3 KB at 345.6 KB/sec)
Downloading: http://repo.maven.apache.org/maven2/org/apache/maven/surefire/maven-surefire-common/2.17/maven-surefire-common-2.17.jar
Downloading: http://repo.maven.apache.org/maven2/org/apache/maven/surefire/surefire-booter/2.17/surefire-booter-2.17.jar
Downloading: http://repo.maven.apache.org/maven2/org/apache/maven/surefire/surefire-api/2.17/surefire-api-2.17.jar
Downloaded: http://repo.maven.apache.org/maven2/org/apache/maven/surefire/maven-surefire-common/2.17/maven-surefire-common-2.17.jar
(260 KB at 18512.1 KB/sec)
Downloaded: http://repo.maven.apache.org/maven2/org/apache/maven/surefire/surefire-booter/2.17/surefire-booter-2.17.jar
(39 KB at 2273.6 KB/sec)
Downloaded: http://repo.maven.apache.org/maven2/org/apache/maven/surefire/surefire-api/2.17/surefire-api-2.17.jar
(144 KB at 8462.2 KB/sec)
[INFO] Tests are skipped.
[JENKINS] Recording test results
[INFO] 
[INFO] --- maven-install-plugin:2.3:install (default-install) @ itest-common ---
[INFO] Installing <https://builds.apache.org/job/Bigtop-trunk-iTest/ws/bigtop-test-framework/target/itest-common-1.1.0-SNAPSHOT.jar>
to /jenkins/maven-repositories/0/org/apache/bigtop/itest/itest-common/1.1.0-SNAPSHOT/itest-common-1.1.0-SNAPSHOT.jar
[INFO] Installing <https://builds.apache.org/job/Bigtop-trunk-iTest/ws/bigtop-test-framework/pom.xml>
to /jenkins/maven-repositories/0/org/apache/bigtop/itest/itest-common/1.1.0-SNAPSHOT/itest-common-1.1.0-SNAPSHOT.pom
[INFO] Installing <https://builds.apache.org/job/Bigtop-trunk-iTest/ws/bigtop-test-framework/target/itest-common-1.1.0-SNAPSHOT-tests.jar>
to /jenkins/maven-repositories/0/org/apache/bigtop/itest/itest-common/1.1.0-SNAPSHOT/itest-common-1.1.0-SNAPSHOT-tests.jar
[INFO] 
[INFO] --- maven-deploy-plugin:2.5:deploy (default-deploy) @ itest-common ---
Downloading: https://repository.apache.org/content/repositories/snapshots/org/apache/bigtop/itest/itest-common/1.1.0-SNAPSHOT/maven-metadata.xml
[WARNING] Could not transfer metadata org.apache.bigtop.itest:itest-common:1.1.0-SNAPSHOT/maven-metadata.xml
from/to apache.snapshots.https (https://repository.apache.org/content/repositories/snapshots):
java.lang.RuntimeException: Could not generate DH keypair
[INFO] ------------------------------------------------------------------------
[INFO] BUILD FAILURE
[INFO] ------------------------------------------------------------------------
[INFO] Total time: 1:04.328s
[INFO] Finished at: Tue Sep 22 16:00:09 UTC 2015
[INFO] Final Memory: 21M/242M
[INFO] ------------------------------------------------------------------------
Waiting for Jenkins to finish collecting data
[ERROR] Failed to execute goal org.apache.maven.plugins:maven-deploy-plugin:2.5:deploy (default-deploy)
on project itest-common: Failed to retrieve remote metadata org.apache.bigtop.itest:itest-common:1.1.0-SNAPSHOT/maven-metadata.xml:
Could not transfer metadata org.apache.bigtop.itest:itest-common:1.1.0-SNAPSHOT/maven-metadata.xml
from/to apache.snapshots.https (https://repository.apache.org/content/repositories/snapshots):
java.lang.RuntimeException: Could not generate DH keypair: Prime size must be multiple of
64, and can only range from 512 to 1024 (inclusive) -> [Help 1]
[ERROR] 
[ERROR] To see the full stack trace of the errors, re-run Maven with the -e switch.
[ERROR] Re-run Maven using the -X switch to enable full debug logging.
[ERROR] 
[ERROR] For more information about the errors and possible solutions, please read the following
articles:
[ERROR] [Help 1] http://cwiki.apache.org/confluence/display/MAVEN/MojoExecutionException
[JENKINS] Archiving <https://builds.apache.org/job/Bigtop-trunk-iTest/ws/bigtop-test-framework/pom.xml>
to org.apache.bigtop.itest/itest-common/1.1.0-SNAPSHOT/itest-common-1.1.0-SNAPSHOT.pom
[JENKINS] Archiving <https://builds.apache.org/job/Bigtop-trunk-iTest/ws/bigtop-test-framework/target/itest-common-1.1.0-SNAPSHOT.jar>
to org.apache.bigtop.itest/itest-common/1.1.0-SNAPSHOT/itest-common-1.1.0-SNAPSHOT.jar
[JENKINS] Archiving <https://builds.apache.org/job/Bigtop-trunk-iTest/ws/bigtop-test-framework/target/itest-common-1.1.0-SNAPSHOT-tests.jar>
to org.apache.bigtop.itest/itest-common/1.1.0-SNAPSHOT/itest-common-1.1.0-SNAPSHOT-tests.jar
Sending artifact delta relative to Bigtop-trunk-iTest ยป iTest: system and integration testing
in the cloud #2295
Archived 3 artifacts
Archive block size is 32768
Received 0 blocks and 286474 bytes
Compression is 0.0%
Took 0.31 sec
Sending e-mails to: ci@bigtop.apache.org
channel stopped

Mime
View raw message