bigtop-ci mailing list archives

Site index · List index
Message view « Date » · « Thread »
Top « Date » · « Thread »
From Apache Jenkins Server <jenk...@builds.apache.org>
Subject Build failed in Jenkins: Bigtop-trunk-testartifacts #1963
Date Sun, 13 Sep 2015 06:04:23 GMT
See <https://builds.apache.org/job/Bigtop-trunk-testartifacts/1963/changes>

Changes:

[evansye] fix BIGTOP-2038, incorrect Pig destination

------------------------------------------
[...truncated 66 lines...]
[INFO] flumesmoke
[INFO] sqoopsmokes
[INFO] mahoutsmoke
[INFO] giraphsmoke
[INFO] huesmoke
[INFO] solrsmoke
[INFO] crunchsmoke
[INFO] datafusmoke
[INFO] io-longevity
[INFO] hcatalogsmoke
[INFO] sparksmoke
[INFO] phoenixsmoke
[INFO] fatjar
[INFO]                                                                         
[INFO] ------------------------------------------------------------------------
[INFO] Building bigtop-smokes 1.1.0-SNAPSHOT
[INFO] ------------------------------------------------------------------------
Downloading: http://repository.apache.org/snapshots/org/apache/bigtop/itest/itest-common/1.1.0-SNAPSHOT/maven-metadata.xml
Downloaded: http://repository.apache.org/snapshots/org/apache/bigtop/itest/itest-common/1.1.0-SNAPSHOT/maven-metadata.xml
(997 B at 0.3 KB/sec)
Downloading: http://repository.apache.org/snapshots/org/apache/bigtop/bigtop/1.1.0-SNAPSHOT/maven-metadata.xml
Downloaded: http://repository.apache.org/snapshots/org/apache/bigtop/bigtop/1.1.0-SNAPSHOT/maven-metadata.xml
(600 B at 1.1 KB/sec)
[INFO] 
[INFO] --- maven-clean-plugin:2.4.1:clean (default-clean) @ bigtop-smokes ---
[INFO] Deleting <https://builds.apache.org/job/Bigtop-trunk-testartifacts/ws/bigtop-tests/test-artifacts/target>
[INFO] 
[INFO] --- maven-remote-resources-plugin:1.1:process (default) @ bigtop-smokes ---
[INFO] Setting property: classpath.resource.loader.class => 'org.codehaus.plexus.velocity.ContextClassLoaderResourceLoader'.
[INFO] Setting property: velocimacro.messages.on => 'false'.
[INFO] Setting property: resource.loader => 'classpath'.
[INFO] Setting property: resource.manager.logwhenfound => 'false'.
[INFO] 
[INFO] --- maven-failsafe-plugin:2.7.1:integration-test (integration-test) @ bigtop-smokes
---
[INFO] No tests to run.
[JENKINS] Recording test results
[INFO] 
[INFO] --- maven-failsafe-plugin:2.7.1:verify (verify) @ bigtop-smokes ---
[INFO] No tests to run.
[JENKINS] Recording test results
[INFO] 
[INFO] --- maven-install-plugin:2.3:install (default-install) @ bigtop-smokes ---
[INFO] Installing <https://builds.apache.org/job/Bigtop-trunk-testartifacts/ws/bigtop-tests/test-artifacts/pom.xml>
to /home/jenkins/jenkins-slave/maven-repositories/1/org/apache/bigtop/itest/bigtop-smokes/1.1.0-SNAPSHOT/bigtop-smokes-1.1.0-SNAPSHOT.pom
[INFO] 
[INFO] --- maven-deploy-plugin:2.5:deploy (default-deploy) @ bigtop-smokes ---
Downloading: https://repository.apache.org/content/repositories/snapshots/org/apache/bigtop/itest/bigtop-smokes/1.1.0-SNAPSHOT/maven-metadata.xml
[WARNING] Could not transfer metadata org.apache.bigtop.itest:bigtop-smokes:1.1.0-SNAPSHOT/maven-metadata.xml
from/to apache.snapshots.https (https://repository.apache.org/content/repositories/snapshots):
java.lang.RuntimeException: Could not generate DH keypair
[INFO] ------------------------------------------------------------------------
[INFO] Reactor Summary:
[INFO] 
[INFO] bigtop-smokes ..................................... FAILURE [7.479s]
[INFO] hadoopsmoke ....................................... SKIPPED
[INFO] packagesmoke ...................................... SKIPPED
[INFO] httpfssmokes ...................................... SKIPPED
[INFO] ooziesmoke ........................................ SKIPPED
[INFO] hbasesmoke ........................................ SKIPPED
[INFO] flumesmoke ........................................ SKIPPED
[INFO] sqoopsmokes ....................................... SKIPPED
[INFO] mahoutsmoke ....................................... SKIPPED
[INFO] giraphsmoke ....................................... SKIPPED
[INFO] huesmoke .......................................... SKIPPED
[INFO] solrsmoke ......................................... SKIPPED
[INFO] crunchsmoke ....................................... SKIPPED
[INFO] datafusmoke ....................................... SKIPPED
[INFO] io-longevity ...................................... SKIPPED
[INFO] hcatalogsmoke ..................................... SKIPPED
[INFO] sparksmoke ........................................ SKIPPED
[INFO] phoenixsmoke ...................................... SKIPPED
[INFO] fatjar ............................................ SKIPPED
[INFO] ------------------------------------------------------------------------
[INFO] BUILD FAILURE
[INFO] ------------------------------------------------------------------------
[INFO] Total time: 50.580s
[INFO] Finished at: Sun Sep 13 05:51:49 UTC 2015
[INFO] Final Memory: 14M/245M
[INFO] ------------------------------------------------------------------------
Waiting for Jenkins to finish collecting data[ERROR] Failed to execute goal org.apache.maven.plugins:maven-deploy-plugin:2.5:deploy
(default-deploy) on project bigtop-smokes: Failed to retrieve remote metadata org.apache.bigtop.itest:bigtop-smokes:1.1.0-SNAPSHOT/maven-metadata.xml:
Could not transfer metadata org.apache.bigtop.itest:bigtop-smokes:1.1.0-SNAPSHOT/maven-metadata.xml
from/to apache.snapshots.https (https://repository.apache.org/content/repositories/snapshots):
java.lang.RuntimeException: Could not generate DH keypair: Prime size must be multiple of
64, and can only range from 512 to 1024 (inclusive) -> [Help 1]
[ERROR] 
[ERROR] To see the full stack trace of the errors, re-run Maven with the -e switch.
[ERROR] Re-run Maven using the -X switch to enable full debug logging.
[ERROR] 
[ERROR] For more information about the errors and possible solutions, please read the following
articles:
[ERROR] [Help 1] http://cwiki.apache.org/confluence/display/MAVEN/MojoExecutionException

[JENKINS] Archiving <https://builds.apache.org/job/Bigtop-trunk-testartifacts/ws/bigtop-tests/test-artifacts/pom.xml>
to org.apache.bigtop.itest/bigtop-smokes/1.1.0-SNAPSHOT/bigtop-smokes-1.1.0-SNAPSHOT.pom
Sending artifact delta relative to Bigtop-trunk-testartifacts » bigtop-smokes #1707
Archived 1 artifacts
Archive block size is 32768
Received 0 blocks and 4894 bytes
Compression is 0.0%
Took 52 ms
[JENKINS] Archiving <https://builds.apache.org/job/Bigtop-trunk-testartifacts/ws/bigtop-tests/test-artifacts/sqoop/pom.xml>
to org.apache.bigtop.itest/sqoop-smoke/1.1.0-SNAPSHOT/sqoop-smoke-1.1.0-SNAPSHOT.pom
Sending artifact delta relative to Bigtop-trunk-testartifacts » sqoopsmokes #1707
Archived 1 artifacts
Archive block size is 32768
Received 0 blocks and 2170 bytes
Compression is 0.0%
Took 26 ms
[JENKINS] Archiving <https://builds.apache.org/job/Bigtop-trunk-testartifacts/ws/bigtop-tests/test-artifacts/hue/pom.xml>
to org.apache.bigtop.itest/hue-smoke/1.1.0-SNAPSHOT/hue-smoke-1.1.0-SNAPSHOT.pom
Sending artifact delta relative to Bigtop-trunk-testartifacts » huesmoke #1707
Archived 1 artifacts
Archive block size is 32768
Received 0 blocks and 1510 bytes
Compression is 0.0%
Took 30 ms
[JENKINS] Archiving <https://builds.apache.org/job/Bigtop-trunk-testartifacts/ws/bigtop-tests/test-artifacts/crunch/pom.xml>
to org.apache.bigtop.itest/crunch-smoke/1.1.0-SNAPSHOT/crunch-smoke-1.1.0-SNAPSHOT.pom
Sending artifact delta relative to Bigtop-trunk-testartifacts » crunchsmoke #1707
Archived 1 artifacts
Archive block size is 32768
Received 0 blocks and 1852 bytes
Compression is 0.0%
Took 59 ms
[JENKINS] Archiving <https://builds.apache.org/job/Bigtop-trunk-testartifacts/ws/bigtop-tests/test-artifacts/package/pom.xml>
to org.apache.bigtop.itest/package-smoke/1.1.0-SNAPSHOT/package-smoke-1.1.0-SNAPSHOT.pom
Sending artifact delta relative to Bigtop-trunk-testartifacts » packagesmoke #1707
Archived 1 artifacts
Archive block size is 32768
Received 0 blocks and 3110 bytes
Compression is 0.0%
Took 70 ms
[JENKINS] Archiving <https://builds.apache.org/job/Bigtop-trunk-testartifacts/ws/bigtop-tests/test-artifacts/flume/pom.xml>
to org.apache.bigtop.itest/flume-smoke/1.1.0-SNAPSHOT/flume-smoke-1.1.0-SNAPSHOT.pom
Sending artifact delta relative to Bigtop-trunk-testartifacts » flumesmoke #1707
Archived 1 artifacts
Archive block size is 32768
Received 0 blocks and 2000 bytes
Compression is 0.0%
Took 44 ms
[JENKINS] Archiving <https://builds.apache.org/job/Bigtop-trunk-testartifacts/ws/bigtop-tests/test-artifacts/httpfs/pom.xml>
to org.apache.bigtop.itest/httpfs-smoke/1.1.0-SNAPSHOT/httpfs-smoke-1.1.0-SNAPSHOT.pom
Sending artifact delta relative to Bigtop-trunk-testartifacts » httpfssmokes #1707
Archived 1 artifacts
Archive block size is 32768
Received 0 blocks and 1878 bytes
Compression is 0.0%
Took 66 ms
[JENKINS] Archiving <https://builds.apache.org/job/Bigtop-trunk-testartifacts/ws/bigtop-tests/test-artifacts/spark/pom.xml>
to org.apache.bigtop.itest/spark-smoke/1.1.0-SNAPSHOT/spark-smoke-1.1.0-SNAPSHOT.pom
Sending artifact delta relative to Bigtop-trunk-testartifacts » sparksmoke #1707
Archived 1 artifacts
Archive block size is 32768
Received 0 blocks and 2266 bytes
Compression is 0.0%
Took 0.22 sec
[JENKINS] Archiving <https://builds.apache.org/job/Bigtop-trunk-testartifacts/ws/bigtop-tests/test-artifacts/hadoop/pom.xml>
to org.apache.bigtop.itest/hadoop-smoke/1.1.0-SNAPSHOT/hadoop-smoke-1.1.0-SNAPSHOT.pom
Sending artifact delta relative to Bigtop-trunk-testartifacts » hadoopsmoke #1707
Archived 1 artifacts
Archive block size is 32768
Received 0 blocks and 2740 bytes
Compression is 0.0%
Took 27 ms
[JENKINS] Archiving <https://builds.apache.org/job/Bigtop-trunk-testartifacts/ws/bigtop-tests/test-artifacts/oozie/pom.xml>
to org.apache.bigtop.itest/oozie-smoke/1.1.0-SNAPSHOT/oozie-smoke-1.1.0-SNAPSHOT.pom
Sending artifact delta relative to Bigtop-trunk-testartifacts » ooziesmoke #1707
Archived 1 artifacts
Archive block size is 32768
Received 0 blocks and 1677 bytes
Compression is 0.0%
Took 73 ms
[JENKINS] Archiving <https://builds.apache.org/job/Bigtop-trunk-testartifacts/ws/bigtop-tests/test-artifacts/giraph/pom.xml>
to org.apache.bigtop.itest/giraph-smoke/1.1.0-SNAPSHOT/giraph-smoke-1.1.0-SNAPSHOT.pom
Sending artifact delta relative to Bigtop-trunk-testartifacts » giraphsmoke #1707
Archived 1 artifacts
Archive block size is 32768
Received 0 blocks and 1522 bytes
Compression is 0.0%
Took 27 ms
[JENKINS] Archiving <https://builds.apache.org/job/Bigtop-trunk-testartifacts/ws/bigtop-tests/test-artifacts/hcatalog/pom.xml>
to org.apache.bigtop.itest/hcatalog-smoke/1.1.0-SNAPSHOT/hcatalog-smoke-1.1.0-SNAPSHOT.pom
Sending artifact delta relative to Bigtop-trunk-testartifacts » hcatalogsmoke #1707
Archived 1 artifacts
Archive block size is 32768
Received 0 blocks and 1903 bytes
Compression is 0.0%
Took 26 ms
[JENKINS] Archiving <https://builds.apache.org/job/Bigtop-trunk-testartifacts/ws/bigtop-tests/test-artifacts/datafu/pom.xml>
to org.apache.bigtop.itest/datafu-smoke/1.1.0-SNAPSHOT/datafu-smoke-1.1.0-SNAPSHOT.pom
Sending artifact delta relative to Bigtop-trunk-testartifacts » datafusmoke #1707
Archived 1 artifacts
Archive block size is 32768
Received 0 blocks and 2733 bytes
Compression is 0.0%
Took 28 ms
[JENKINS] Archiving <https://builds.apache.org/job/Bigtop-trunk-testartifacts/ws/bigtop-tests/test-artifacts/longevity/pom.xml>
to org.apache.bigtop.itest/io-longevity/1.1.0-SNAPSHOT/io-longevity-1.1.0-SNAPSHOT.pom
Sending artifact delta relative to Bigtop-trunk-testartifacts » io-longevity #1707
Archived 1 artifacts
Archive block size is 32768
Received 0 blocks and 1699 bytes
Compression is 0.0%
Took 26 ms
[JENKINS] Archiving <https://builds.apache.org/job/Bigtop-trunk-testartifacts/ws/bigtop-tests/test-artifacts/mahout/pom.xml>
to org.apache.bigtop.itest/mahout-smoke/1.1.0-SNAPSHOT/mahout-smoke-1.1.0-SNAPSHOT.pom
Sending artifact delta relative to Bigtop-trunk-testartifacts » mahoutsmoke #1707
Archived 1 artifacts
Archive block size is 32768
Received 0 blocks and 1522 bytes
Compression is 0.0%
Took 62 ms
[JENKINS] Archiving <https://builds.apache.org/job/Bigtop-trunk-testartifacts/ws/bigtop-tests/test-artifacts/hbase/pom.xml>
to org.apache.bigtop.itest/hbase-smoke/1.1.0-SNAPSHOT/hbase-smoke-1.1.0-SNAPSHOT.pom
Sending artifact delta relative to Bigtop-trunk-testartifacts » hbasesmoke #1707
Archived 1 artifacts
Archive block size is 32768
Received 0 blocks and 2660 bytes
Compression is 0.0%
Took 49 ms
[JENKINS] Archiving <https://builds.apache.org/job/Bigtop-trunk-testartifacts/ws/bigtop-tests/test-artifacts/solr/pom.xml>
to org.apache.bigtop.itest/solr-smoke/1.1.0-SNAPSHOT/solr-smoke-1.1.0-SNAPSHOT.pom
Sending artifact delta relative to Bigtop-trunk-testartifacts » solrsmoke #1707
Archived 1 artifacts
Archive block size is 32768
Received 0 blocks and 1784 bytes
Compression is 0.0%
Took 26 ms
[JENKINS] Archiving <https://builds.apache.org/job/Bigtop-trunk-testartifacts/ws/bigtop-tests/test-artifacts/phoenix/pom.xml>
to org.apache.bigtop.itest/phoenix-smoke/1.1.0-SNAPSHOT/phoenix-smoke-1.1.0-SNAPSHOT.pom
Sending artifact delta relative to Bigtop-trunk-testartifacts » phoenixsmoke #1707
Archived 1 artifacts
Archive block size is 32768
Received 0 blocks and 1526 bytes
Compression is 0.0%
Took 29 ms
[JENKINS] Archiving <https://builds.apache.org/job/Bigtop-trunk-testartifacts/ws/bigtop-tests/test-artifacts/fatjar/pom.xml>
to org.apache.bigtop.itest/fat-smoke/1.1.0-SNAPSHOT/fat-smoke-1.1.0-SNAPSHOT.pom
Sending artifact delta relative to Bigtop-trunk-testartifacts » fatjar #1707
Archived 1 artifacts
Archive block size is 32768
Received 0 blocks and 5244 bytes
Compression is 0.0%
Took 6.2 sec
Sending e-mails to: ci@bigtop.apache.org
FATAL: channel is already closed
hudson.remoting.ChannelClosedException: channel is already closed
	at hudson.remoting.Channel.send(Channel.java:540)
	at hudson.remoting.Request.call(Request.java:129)
	at hudson.remoting.Channel.call(Channel.java:742)
	at hudson.Launcher$RemoteLauncher.kill(Launcher.java:918)
	at hudson.model.AbstractBuild$AbstractBuildExecution.run(AbstractBuild.java:552)
	at hudson.model.Run.execute(Run.java:1706)
	at hudson.maven.MavenModuleSetBuild.run(MavenModuleSetBuild.java:529)
	at hudson.model.ResourceController.execute(ResourceController.java:88)
	at hudson.model.Executor.run(Executor.java:232)
Caused by: java.io.IOException: Sorry, this connection is closed.
	at com.trilead.ssh2.transport.TransportManager.sendMessage(TransportManager.java:647)
	at com.trilead.ssh2.channel.Channel.freeupWindow(Channel.java:391)
	at com.trilead.ssh2.channel.Channel.freeupWindow(Channel.java:331)
	at com.trilead.ssh2.channel.ChannelManager.getChannelData(ChannelManager.java:953)
	at com.trilead.ssh2.channel.ChannelInputStream.read(ChannelInputStream.java:58)
	at com.trilead.ssh2.channel.ChannelInputStream.read(ChannelInputStream.java:79)
	at hudson.remoting.FlightRecorderInputStream.read(FlightRecorderInputStream.java:82)
	at hudson.remoting.ChunkedInputStream.readHeader(ChunkedInputStream.java:72)
	at hudson.remoting.ChunkedInputStream.readUntilBreak(ChunkedInputStream.java:103)
	at hudson.remoting.ChunkedCommandTransport.readBlock(ChunkedCommandTransport.java:33)
	at hudson.remoting.AbstractSynchronousByteArrayCommandTransport.read(AbstractSynchronousByteArrayCommandTransport.java:34)
	at hudson.remoting.SynchronousCommandTransport$ReaderThread.run(SynchronousCommandTransport.java:48)
Caused by: java.io.IOException: Error: the peer is not consuming our asynchronous replies.
	at com.trilead.ssh2.transport.TransportManager.sendAsynchronousMessage(TransportManager.java:613)
	at com.trilead.ssh2.channel.Channel.freeupWindow(Channel.java:389)
	at com.trilead.ssh2.channel.Channel$Output.write(Channel.java:99)
	at com.trilead.ssh2.channel.ChannelManager.msgChannelExtendedData(ChannelManager.java:858)
	at com.trilead.ssh2.channel.ChannelManager.handleMessage(ChannelManager.java:1517)
	at com.trilead.ssh2.transport.TransportManager.receiveLoop(TransportManager.java:785)
	at com.trilead.ssh2.transport.TransportManager$1.run(TransportManager.java:480)
	at java.lang.Thread.run(Thread.java:745)

Mime
View raw message