bigtop-ci mailing list archives

Site index · List index
Message view « Date » · « Thread »
Top « Date » · « Thread »
From Apache Jenkins Server <jenk...@builds.apache.org>
Subject Build failed in Jenkins: Bigtop-trunk-testartifacts #1927
Date Wed, 12 Aug 2015 15:28:00 GMT
See <https://builds.apache.org/job/Bigtop-trunk-testartifacts/1927/changes>

Changes:

[of] BIGTOP-1916: Update Website for 1.0

[of] BIGTOP-1964. Upgrade Tez version to 0.6.2

------------------------------------------
[...truncated 209 lines...]
Downloading: http://repo.maven.apache.org/maven2/org/apache/maven/maven-plugin-registry/2.0.5/maven-plugin-registry-2.0.5.pom
Downloaded: http://repo.maven.apache.org/maven2/org/apache/maven/maven-plugin-registry/2.0.5/maven-plugin-registry-2.0.5.pom
(2 KB at 36.4 KB/sec)
Downloading: http://repo.maven.apache.org/maven2/org/apache/maven/maven-plugin-api/2.0.5/maven-plugin-api-2.0.5.pom
Downloaded: http://repo.maven.apache.org/maven2/org/apache/maven/maven-plugin-api/2.0.5/maven-plugin-api-2.0.5.pom
(605 B at 14.1 KB/sec)
Downloading: http://repo.maven.apache.org/maven2/org/apache/maven/maven-plugin-descriptor/2.0.5/maven-plugin-descriptor-2.0.5.pom
Downloaded: http://repo.maven.apache.org/maven2/org/apache/maven/maven-plugin-descriptor/2.0.5/maven-plugin-descriptor-2.0.5.pom
(2 KB at 43.2 KB/sec)
Downloading: http://repo.maven.apache.org/maven2/org/apache/maven/maven-monitor/2.0.5/maven-monitor-2.0.5.pom
Downloaded: http://repo.maven.apache.org/maven2/org/apache/maven/maven-monitor/2.0.5/maven-monitor-2.0.5.pom
(404 B at 9.9 KB/sec)
Downloading: http://repo.maven.apache.org/maven2/velocity/velocity-dep/1.4/velocity-dep-1.4.pom
Downloaded: http://repo.maven.apache.org/maven2/velocity/velocity-dep/1.4/velocity-dep-1.4.pom
(2 KB at 31.4 KB/sec)
Downloading: http://repo.maven.apache.org/maven2/org/apache/maven/shared/maven-common-artifact-filters/1.0/maven-common-artifact-filters-1.0.pom
Downloaded: http://repo.maven.apache.org/maven2/org/apache/maven/shared/maven-common-artifact-filters/1.0/maven-common-artifact-filters-1.0.pom
(2 KB at 51.8 KB/sec)
Downloading: http://repo.maven.apache.org/maven2/org/apache/maven/shared/maven-downloader/1.1/maven-downloader-1.1.pom
Downloaded: http://repo.maven.apache.org/maven2/org/apache/maven/shared/maven-downloader/1.1/maven-downloader-1.1.pom
(2 KB at 39.4 KB/sec)
Downloading: http://repo.maven.apache.org/maven2/org/codehaus/plexus/plexus-velocity/1.1.3/plexus-velocity-1.1.3.pom
Downloaded: http://repo.maven.apache.org/maven2/org/codehaus/plexus/plexus-velocity/1.1.3/plexus-velocity-1.1.3.pom
(976 B at 24.4 KB/sec)
Downloading: http://repo.maven.apache.org/maven2/org/codehaus/plexus/plexus-components/1.1.5/plexus-components-1.1.5.pom
Downloaded: http://repo.maven.apache.org/maven2/org/codehaus/plexus/plexus-components/1.1.5/plexus-components-1.1.5.pom
(3 KB at 50.4 KB/sec)
Downloading: http://repo.maven.apache.org/maven2/velocity/velocity/1.4/velocity-1.4.pom
Downloaded: http://repo.maven.apache.org/maven2/velocity/velocity/1.4/velocity-1.4.pom (3
KB at 56.6 KB/sec)
Downloading: http://repo.maven.apache.org/maven2/org/codehaus/plexus/plexus-resources/1.0-alpha-5/plexus-resources-1.0-alpha-5.pom
Downloaded: http://repo.maven.apache.org/maven2/org/codehaus/plexus/plexus-resources/1.0-alpha-5/plexus-resources-1.0-alpha-5.pom
(2 KB at 32.4 KB/sec)
Downloading: http://repo.maven.apache.org/maven2/org/apache/maven/shared/maven-filtering/1.0-beta-3/maven-filtering-1.0-beta-3.jar
Downloading: http://repo.maven.apache.org/maven2/org/apache/maven/reporting/maven-reporting-api/2.0.5/maven-reporting-api-2.0.5.jar
Downloading: http://repo.maven.apache.org/maven2/org/apache/maven/shared/maven-common-artifact-filters/1.0/maven-common-artifact-filters-1.0.jar
Downloading: http://repo.maven.apache.org/maven2/velocity/velocity-dep/1.4/velocity-dep-1.4.jar
Downloading: http://repo.maven.apache.org/maven2/org/apache/maven/shared/maven-downloader/1.1/maven-downloader-1.1.jar
Downloaded: http://repo.maven.apache.org/maven2/org/apache/maven/shared/maven-filtering/1.0-beta-3/maven-filtering-1.0-beta-3.jar
(34 KB at 781.3 KB/sec)
Downloading: http://repo.maven.apache.org/maven2/org/codehaus/plexus/plexus-utils/1.5.12/plexus-utils-1.5.12.jar
Downloaded: http://repo.maven.apache.org/maven2/org/apache/maven/reporting/maven-reporting-api/2.0.5/maven-reporting-api-2.0.5.jar
(10 KB at 215.7 KB/sec)
Downloading: http://repo.maven.apache.org/maven2/org/codehaus/plexus/plexus-velocity/1.1.3/plexus-velocity-1.1.3.jar
Downloaded: http://repo.maven.apache.org/maven2/org/apache/maven/shared/maven-common-artifact-filters/1.0/maven-common-artifact-filters-1.0.jar
(27 KB at 554.5 KB/sec)
Downloading: http://repo.maven.apache.org/maven2/commons-collections/commons-collections/2.0/commons-collections-2.0.jar
Downloaded: http://repo.maven.apache.org/maven2/org/apache/maven/shared/maven-downloader/1.1/maven-downloader-1.1.jar
(7 KB at 147.1 KB/sec)
Downloading: http://repo.maven.apache.org/maven2/velocity/velocity/1.4/velocity-1.4.jar
Downloaded: http://repo.maven.apache.org/maven2/org/codehaus/plexus/plexus-velocity/1.1.3/plexus-velocity-1.1.3.jar
(8 KB at 220.8 KB/sec)
Downloading: http://repo.maven.apache.org/maven2/org/codehaus/plexus/plexus-resources/1.0-alpha-5/plexus-resources-1.0-alpha-5.jar
Downloaded: http://repo.maven.apache.org/maven2/commons-collections/commons-collections/2.0/commons-collections-2.0.jar
(89 KB at 2455.1 KB/sec)
Downloaded: http://repo.maven.apache.org/maven2/org/codehaus/plexus/plexus-utils/1.5.12/plexus-utils-1.5.12.jar
(276 KB at 4910.8 KB/sec)
Downloaded: http://repo.maven.apache.org/maven2/velocity/velocity/1.4/velocity-1.4.jar (353
KB at 5688.8 KB/sec)
Downloaded: http://repo.maven.apache.org/maven2/org/codehaus/plexus/plexus-resources/1.0-alpha-5/plexus-resources-1.0-alpha-5.jar
(22 KB at 543.6 KB/sec)
Downloaded: http://repo.maven.apache.org/maven2/velocity/velocity-dep/1.4/velocity-dep-1.4.jar
(506 KB at 4110.8 KB/sec)
[INFO] Setting property: classpath.resource.loader.class => 'org.codehaus.plexus.velocity.ContextClassLoaderResourceLoader'.
[INFO] Setting property: velocimacro.messages.on => 'false'.
[INFO] Setting property: resource.loader => 'classpath'.
[INFO] Setting property: resource.manager.logwhenfound => 'false'.
[INFO] 
[INFO] --- maven-failsafe-plugin:2.7.1:integration-test (integration-test) @ bigtop-smokes
---
Downloading: http://repo.maven.apache.org/maven2/org/apache/maven/surefire/surefire-booter/2.7.1/surefire-booter-2.7.1.pom
Downloaded: http://repo.maven.apache.org/maven2/org/apache/maven/surefire/surefire-booter/2.7.1/surefire-booter-2.7.1.pom
(2 KB at 43.8 KB/sec)
Downloading: http://repo.maven.apache.org/maven2/org/apache/maven/surefire/surefire-api/2.7.1/surefire-api-2.7.1.pom
Downloaded: http://repo.maven.apache.org/maven2/org/apache/maven/surefire/surefire-api/2.7.1/surefire-api-2.7.1.pom
(2 KB at 48.0 KB/sec)
Downloading: http://repo.maven.apache.org/maven2/org/apache/maven/surefire/maven-surefire-common/2.7.1/maven-surefire-common-2.7.1.pom
Downloaded: http://repo.maven.apache.org/maven2/org/apache/maven/surefire/maven-surefire-common/2.7.1/maven-surefire-common-2.7.1.pom
(4 KB at 91.0 KB/sec)
Downloading: http://repo.maven.apache.org/maven2/org/apache/maven/maven-toolchain/2.2.1/maven-toolchain-2.2.1.pom
Downloaded: http://repo.maven.apache.org/maven2/org/apache/maven/maven-toolchain/2.2.1/maven-toolchain-2.2.1.pom
(4 KB at 85.9 KB/sec)
Downloading: http://repo.maven.apache.org/maven2/org/apache/maven/surefire/surefire-booter/2.7.1/surefire-booter-2.7.1.jar
Downloading: http://repo.maven.apache.org/maven2/org/apache/maven/surefire/surefire-api/2.7.1/surefire-api-2.7.1.jar
Downloading: http://repo.maven.apache.org/maven2/org/apache/maven/surefire/maven-surefire-common/2.7.1/maven-surefire-common-2.7.1.jar
Downloaded: http://repo.maven.apache.org/maven2/org/apache/maven/surefire/surefire-booter/2.7.1/surefire-booter-2.7.1.jar
(32 KB at 762.5 KB/sec)
Downloaded: http://repo.maven.apache.org/maven2/org/apache/maven/surefire/maven-surefire-common/2.7.1/maven-surefire-common-2.7.1.jar
(56 KB at 1034.8 KB/sec)
Downloaded: http://repo.maven.apache.org/maven2/org/apache/maven/surefire/surefire-api/2.7.1/surefire-api-2.7.1.jar
(112 KB at 1398.4 KB/sec)
[INFO] No tests to run.
[JENKINS] Recording test results
[INFO] 
[INFO] --- maven-failsafe-plugin:2.7.1:verify (verify) @ bigtop-smokes ---
[INFO] No tests to run.
[JENKINS] Recording test results
[INFO] 
[INFO] --- maven-install-plugin:2.3:install (default-install) @ bigtop-smokes ---
Downloading: http://repo.maven.apache.org/maven2/org/codehaus/plexus/plexus-utils/1.5.6/plexus-utils-1.5.6.jar
Downloaded: http://repo.maven.apache.org/maven2/org/codehaus/plexus/plexus-utils/1.5.6/plexus-utils-1.5.6.jar
(245 KB at 2575.5 KB/sec)
[INFO] Installing <https://builds.apache.org/job/Bigtop-trunk-testartifacts/ws/bigtop-tests/test-artifacts/pom.xml>
to /jenkins/maven-repositories/0/org/apache/bigtop/itest/bigtop-smokes/1.1.0-SNAPSHOT/bigtop-smokes-1.1.0-SNAPSHOT.pom
[INFO] 
[INFO] --- maven-deploy-plugin:2.5:deploy (default-deploy) @ bigtop-smokes ---
Downloading: https://repository.apache.org/content/repositories/snapshots/org/apache/bigtop/itest/bigtop-smokes/1.1.0-SNAPSHOT/maven-metadata.xml
[WARNING] Could not transfer metadata org.apache.bigtop.itest:bigtop-smokes:1.1.0-SNAPSHOT/maven-metadata.xml
from/to apache.snapshots.https (https://repository.apache.org/content/repositories/snapshots):
java.lang.RuntimeException: Could not generate DH keypair
[INFO] ------------------------------------------------------------------------
[INFO] Reactor Summary:
[INFO] 
[INFO] bigtop-smokes ..................................... FAILURE [14.557s]
[INFO] hadoopsmoke ....................................... SKIPPED
[INFO] packagesmoke ...................................... SKIPPED
[INFO] httpfssmokes ...................................... SKIPPED
[INFO] ooziesmoke ........................................ SKIPPED
[INFO] hbasesmoke ........................................ SKIPPED
[INFO] flumesmoke ........................................ SKIPPED
[INFO] sqoopsmokes ....................................... SKIPPED
[INFO] mahoutsmoke ....................................... SKIPPED
[INFO] giraphsmoke ....................................... SKIPPED
[INFO] huesmoke .......................................... SKIPPED
[INFO] solrsmoke ......................................... SKIPPED
[INFO] crunchsmoke ....................................... SKIPPED
[INFO] datafusmoke ....................................... SKIPPED
[INFO] io-longevity ...................................... SKIPPED
[INFO] hcatalogsmoke ..................................... SKIPPED
[INFO] sparksmoke ........................................ SKIPPED
[INFO] phoenixsmoke ...................................... SKIPPED
[INFO] fatjar ............................................ SKIPPED
[INFO] ------------------------------------------------------------------------
[INFO] BUILD FAILURE
[INFO] ------------------------------------------------------------------------
[INFO] Total time: 21.778s
[INFO] Finished at: Wed Aug 12 15:28:26 UTC 2015
[INFO] Final Memory: 14M/246M
[INFO] ------------------------------------------------------------------------
Waiting for Jenkins to finish collecting data
[ERROR] Failed to execute goal org.apache.maven.plugins:maven-deploy-plugin:2.5:deploy (default-deploy)
on project bigtop-smokes: Failed to retrieve remote metadata org.apache.bigtop.itest:bigtop-smokes:1.1.0-SNAPSHOT/maven-metadata.xml:
Could not transfer metadata org.apache.bigtop.itest:bigtop-smokes:1.1.0-SNAPSHOT/maven-metadata.xml
from/to apache.snapshots.https (https://repository.apache.org/content/repositories/snapshots):
java.lang.RuntimeException: Could not generate DH keypair: Prime size must be multiple of
64, and can only range from 512 to 1024 (inclusive) -> [Help 1]
[ERROR] 
[ERROR] To see the full stack trace of the errors, re-run Maven with the -e switch.
[ERROR] Re-run Maven using the -X switch to enable full debug logging.
[ERROR] 
[ERROR] For more information about the errors and possible solutions, please read the following
articles:
[ERROR] [Help 1] http://cwiki.apache.org/confluence/display/MAVEN/MojoExecutionException
[JENKINS] Archiving <https://builds.apache.org/job/Bigtop-trunk-testartifacts/ws/bigtop-tests/test-artifacts/pom.xml>
to org.apache.bigtop.itest/bigtop-smokes/1.1.0-SNAPSHOT/bigtop-smokes-1.1.0-SNAPSHOT.pom
Sending artifact delta relative to Bigtop-trunk-testartifacts » bigtop-smokes #1919
Archived 1 artifacts
Archive block size is 32768
Received 0 blocks and 4894 bytes
Compression is 0.0%
Took 0.34 sec
[JENKINS] Archiving <https://builds.apache.org/job/Bigtop-trunk-testartifacts/ws/bigtop-tests/test-artifacts/sqoop/pom.xml>
to org.apache.bigtop.itest/sqoop-smoke/1.1.0-SNAPSHOT/sqoop-smoke-1.1.0-SNAPSHOT.pom
Sending artifact delta relative to Bigtop-trunk-testartifacts » sqoopsmokes #1707
Archived 1 artifacts
Archive block size is 32768
Received 0 blocks and 2170 bytes
Compression is 0.0%
Took 0.14 sec
[JENKINS] Archiving <https://builds.apache.org/job/Bigtop-trunk-testartifacts/ws/bigtop-tests/test-artifacts/hue/pom.xml>
to org.apache.bigtop.itest/hue-smoke/1.1.0-SNAPSHOT/hue-smoke-1.1.0-SNAPSHOT.pom
Sending artifact delta relative to Bigtop-trunk-testartifacts » huesmoke #1707
Archived 1 artifacts
Archive block size is 32768
Received 0 blocks and 1510 bytes
Compression is 0.0%
Took 0.34 sec
[JENKINS] Archiving <https://builds.apache.org/job/Bigtop-trunk-testartifacts/ws/bigtop-tests/test-artifacts/crunch/pom.xml>
to org.apache.bigtop.itest/crunch-smoke/1.1.0-SNAPSHOT/crunch-smoke-1.1.0-SNAPSHOT.pom
Sending artifact delta relative to Bigtop-trunk-testartifacts » crunchsmoke #1707
Archived 1 artifacts
Archive block size is 32768
Received 0 blocks and 1852 bytes
Compression is 0.0%
Took 0.16 sec
[JENKINS] Archiving <https://builds.apache.org/job/Bigtop-trunk-testartifacts/ws/bigtop-tests/test-artifacts/package/pom.xml>
to org.apache.bigtop.itest/package-smoke/1.1.0-SNAPSHOT/package-smoke-1.1.0-SNAPSHOT.pom
Sending artifact delta relative to Bigtop-trunk-testartifacts » packagesmoke #1919
Archived 1 artifacts
Archive block size is 32768
Received 0 blocks and 3110 bytes
Compression is 0.0%
Took 0.47 sec
[JENKINS] Archiving <https://builds.apache.org/job/Bigtop-trunk-testartifacts/ws/bigtop-tests/test-artifacts/flume/pom.xml>
to org.apache.bigtop.itest/flume-smoke/1.1.0-SNAPSHOT/flume-smoke-1.1.0-SNAPSHOT.pom
Sending artifact delta relative to Bigtop-trunk-testartifacts » flumesmoke #1919
Archived 1 artifacts
Archive block size is 32768
Received 0 blocks and 2000 bytes
Compression is 0.0%
Took 0.16 sec
[JENKINS] Archiving <https://builds.apache.org/job/Bigtop-trunk-testartifacts/ws/bigtop-tests/test-artifacts/httpfs/pom.xml>
to org.apache.bigtop.itest/httpfs-smoke/1.1.0-SNAPSHOT/httpfs-smoke-1.1.0-SNAPSHOT.pom
Sending artifact delta relative to Bigtop-trunk-testartifacts » httpfssmokes #1919
Archived 1 artifacts
Archive block size is 32768
Received 0 blocks and 1878 bytes
Compression is 0.0%
Took 0.16 sec
[JENKINS] Archiving <https://builds.apache.org/job/Bigtop-trunk-testartifacts/ws/bigtop-tests/test-artifacts/spark/pom.xml>
to org.apache.bigtop.itest/spark-smoke/1.1.0-SNAPSHOT/spark-smoke-1.1.0-SNAPSHOT.pom
Sending artifact delta relative to Bigtop-trunk-testartifacts » sparksmoke #1707
Archived 1 artifacts
Archive block size is 32768
Received 0 blocks and 2266 bytes
Compression is 0.0%
Took 0.14 sec
[JENKINS] Archiving <https://builds.apache.org/job/Bigtop-trunk-testartifacts/ws/bigtop-tests/test-artifacts/hadoop/pom.xml>
to org.apache.bigtop.itest/hadoop-smoke/1.1.0-SNAPSHOT/hadoop-smoke-1.1.0-SNAPSHOT.pom
Sending artifact delta relative to Bigtop-trunk-testartifacts » hadoopsmoke #1919
Archived 1 artifacts
Archive block size is 32768
Received 0 blocks and 2740 bytes
Compression is 0.0%
Took 0.14 sec
[JENKINS] Archiving <https://builds.apache.org/job/Bigtop-trunk-testartifacts/ws/bigtop-tests/test-artifacts/oozie/pom.xml>
to org.apache.bigtop.itest/oozie-smoke/1.1.0-SNAPSHOT/oozie-smoke-1.1.0-SNAPSHOT.pom
Sending artifact delta relative to Bigtop-trunk-testartifacts » ooziesmoke #1919
Archived 1 artifacts
Archive block size is 32768
Received 0 blocks and 1677 bytes
Compression is 0.0%
Took 0.14 sec
[JENKINS] Archiving <https://builds.apache.org/job/Bigtop-trunk-testartifacts/ws/bigtop-tests/test-artifacts/giraph/pom.xml>
to org.apache.bigtop.itest/giraph-smoke/1.1.0-SNAPSHOT/giraph-smoke-1.1.0-SNAPSHOT.pom
Sending artifact delta relative to Bigtop-trunk-testartifacts » giraphsmoke #1707
Archived 1 artifacts
Archive block size is 32768
Received 0 blocks and 1522 bytes
Compression is 0.0%
Took 0.19 sec
[JENKINS] Archiving <https://builds.apache.org/job/Bigtop-trunk-testartifacts/ws/bigtop-tests/test-artifacts/hcatalog/pom.xml>
to org.apache.bigtop.itest/hcatalog-smoke/1.1.0-SNAPSHOT/hcatalog-smoke-1.1.0-SNAPSHOT.pom
Sending artifact delta relative to Bigtop-trunk-testartifacts » hcatalogsmoke #1707
Archived 1 artifacts
Archive block size is 32768
Received 0 blocks and 1903 bytes
Compression is 0.0%
Took 0.14 sec
[JENKINS] Archiving <https://builds.apache.org/job/Bigtop-trunk-testartifacts/ws/bigtop-tests/test-artifacts/datafu/pom.xml>
to org.apache.bigtop.itest/datafu-smoke/1.1.0-SNAPSHOT/datafu-smoke-1.1.0-SNAPSHOT.pom
Sending artifact delta relative to Bigtop-trunk-testartifacts » datafusmoke #1707
Archived 1 artifacts
Archive block size is 32768
Received 0 blocks and 2733 bytes
Compression is 0.0%
Took 0.14 sec
[JENKINS] Archiving <https://builds.apache.org/job/Bigtop-trunk-testartifacts/ws/bigtop-tests/test-artifacts/longevity/pom.xml>
to org.apache.bigtop.itest/io-longevity/1.1.0-SNAPSHOT/io-longevity-1.1.0-SNAPSHOT.pom
Sending artifact delta relative to Bigtop-trunk-testartifacts » io-longevity #1707
Archived 1 artifacts
Archive block size is 32768
Received 0 blocks and 1699 bytes
Compression is 0.0%
Took 0.15 sec
[JENKINS] Archiving <https://builds.apache.org/job/Bigtop-trunk-testartifacts/ws/bigtop-tests/test-artifacts/mahout/pom.xml>
to org.apache.bigtop.itest/mahout-smoke/1.1.0-SNAPSHOT/mahout-smoke-1.1.0-SNAPSHOT.pom
Sending artifact delta relative to Bigtop-trunk-testartifacts » mahoutsmoke #1707
Archived 1 artifacts
Archive block size is 32768
Received 0 blocks and 1522 bytes
Compression is 0.0%
Took 0.21 sec
[JENKINS] Archiving <https://builds.apache.org/job/Bigtop-trunk-testartifacts/ws/bigtop-tests/test-artifacts/hbase/pom.xml>
to org.apache.bigtop.itest/hbase-smoke/1.1.0-SNAPSHOT/hbase-smoke-1.1.0-SNAPSHOT.pom
Sending artifact delta relative to Bigtop-trunk-testartifacts » hbasesmoke #1919
Archived 1 artifacts
Archive block size is 32768
Received 0 blocks and 2660 bytes
Compression is 0.0%
Took 0.3 sec
[JENKINS] Archiving <https://builds.apache.org/job/Bigtop-trunk-testartifacts/ws/bigtop-tests/test-artifacts/solr/pom.xml>
to org.apache.bigtop.itest/solr-smoke/1.1.0-SNAPSHOT/solr-smoke-1.1.0-SNAPSHOT.pom
Sending artifact delta relative to Bigtop-trunk-testartifacts » solrsmoke #1707
Archived 1 artifacts
Archive block size is 32768
Received 0 blocks and 1784 bytes
Compression is 0.0%
Took 0.51 sec
[JENKINS] Archiving <https://builds.apache.org/job/Bigtop-trunk-testartifacts/ws/bigtop-tests/test-artifacts/phoenix/pom.xml>
to org.apache.bigtop.itest/phoenix-smoke/1.1.0-SNAPSHOT/phoenix-smoke-1.1.0-SNAPSHOT.pom
Sending artifact delta relative to Bigtop-trunk-testartifacts » phoenixsmoke #1707
Archived 1 artifacts
Archive block size is 32768
Received 0 blocks and 1526 bytes
Compression is 0.0%
Took 0.45 sec
[JENKINS] Archiving <https://builds.apache.org/job/Bigtop-trunk-testartifacts/ws/bigtop-tests/test-artifacts/fatjar/pom.xml>
to org.apache.bigtop.itest/fat-smoke/1.1.0-SNAPSHOT/fat-smoke-1.1.0-SNAPSHOT.pom
Sending artifact delta relative to Bigtop-trunk-testartifacts » fatjar #1707
Archived 1 artifacts
Archive block size is 32768
Received 0 blocks and 5244 bytes
Compression is 0.0%
Took 3.6 sec
Sending e-mails to: ci@bigtop.apache.org
channel stopped

Mime
View raw message