bigtop-ci mailing list archives

Site index · List index
Message view « Date » · « Thread »
Top « Date » · « Thread »
From Apache Jenkins Server <jenk...@builds.apache.org>
Subject Build failed in Jenkins: Bigtop-trunk-test-execution #1630
Date Mon, 03 Aug 2015 22:06:36 GMT
See <https://builds.apache.org/job/Bigtop-trunk-test-execution/1630/changes>

Changes:

[of] BIGTOP-1947. Fix RAT plugin configuration to be able to RAT-validate all published artifacts

[cos] BIGTOP-1954. Change the component name in the MAINTAINERS.txt

------------------------------------------
Started by an SCM change
Started by an SCM change
Started by an SCM change
Started by an SCM change
Started by an SCM change
Started by an SCM change
Started by an SCM change
Started by an SCM change
Started by an SCM change
Building remotely on ubuntu-5 (docker Ubuntu ubuntu5 ubuntu) in workspace <https://builds.apache.org/job/Bigtop-trunk-test-execution/ws/>
 > git rev-parse --is-inside-work-tree # timeout=10
Fetching changes from the remote Git repository
 > git config remote.origin.url https://git-wip-us.apache.org/repos/asf/bigtop.git # timeout=10
Fetching upstream changes from https://git-wip-us.apache.org/repos/asf/bigtop.git
 > git --version # timeout=10
 > git fetch --tags --progress https://git-wip-us.apache.org/repos/asf/bigtop.git +refs/heads/*:refs/remotes/origin/*
 > git rev-parse origin/master^{commit} # timeout=10
Checking out Revision 1715e03ab03accc0d66a53580a888531e0973c7e (origin/master)
 > git config core.sparsecheckout # timeout=10
 > git checkout -f 1715e03ab03accc0d66a53580a888531e0973c7e
 > git rev-list db0c8e3c85df18988f594c8f65308a28c059ebe0 # timeout=10
[Bigtop-trunk-test-execution] $ /home/jenkins/tools/maven/apache-maven-3.0.4/bin/mvn -f bigtop-tests/test-execution/pom.xml
clean
[INFO] Scanning for projects...
[INFO] ------------------------------------------------------------------------
[INFO] Reactor Build Order:
[INFO] 
[INFO] stacks-validation-common
[INFO] smoke-tests-conf
[INFO] packagesmokes
[INFO] bigtop-smokes
[INFO]                                                                         
[INFO] ------------------------------------------------------------------------
[INFO] Building stacks-validation-common 1.1.0-SNAPSHOT
[INFO] ------------------------------------------------------------------------
[INFO] 
[INFO] --- maven-clean-plugin:2.4.1:clean (default-clean) @ stacks-common ---
[INFO] Deleting <https://builds.apache.org/job/Bigtop-trunk-test-execution/ws/bigtop-tests/test-execution/common/target>
[INFO]                                                                         
[INFO] ------------------------------------------------------------------------
[INFO] Building smoke-tests-conf 1.1.0-SNAPSHOT
[INFO] ------------------------------------------------------------------------
[INFO] 
[INFO] --- maven-clean-plugin:2.4.1:clean (default-clean) @ smoke-tests-conf ---
[INFO]                                                                         
[INFO] ------------------------------------------------------------------------
[INFO] Building packagesmokes 1.1.0-SNAPSHOT
[INFO] ------------------------------------------------------------------------
[INFO] 
[INFO] --- maven-clean-plugin:2.4.1:clean (default-clean) @ package-smoke-execution ---
[INFO]                                                                         
[INFO] ------------------------------------------------------------------------
[INFO] Building bigtop-smokes 1.1.0-SNAPSHOT
[INFO] ------------------------------------------------------------------------
[INFO] 
[INFO] --- maven-clean-plugin:2.4.1:clean (default-clean) @ bigtop-test-execution ---
[INFO] ------------------------------------------------------------------------
[INFO] Reactor Summary:
[INFO] 
[INFO] stacks-validation-common .......................... SUCCESS [0.188s]
[INFO] smoke-tests-conf .................................. SUCCESS [0.002s]
[INFO] packagesmokes ..................................... SUCCESS [0.097s]
[INFO] bigtop-smokes ..................................... SUCCESS [0.002s]
[INFO] ------------------------------------------------------------------------
[INFO] BUILD SUCCESS
[INFO] ------------------------------------------------------------------------
[INFO] Total time: 0.922s
[INFO] Finished at: Mon Aug 03 22:07:10 UTC 2015
[INFO] Final Memory: 3M/77M
[INFO] ------------------------------------------------------------------------
[Bigtop-trunk-test-execution] $ /bin/bash -xe /tmp/hudson9050406215799481844.sh
+ export HADOOP_CONF_DIR=
+ HADOOP_CONF_DIR=
+ export HADOOP_HOME=
+ HADOOP_HOME=
+ /home/jenkins/tools/maven/apache-maven-3.0.4/bin/mvn -f bigtop-tests/test-execution/pom.xml
-DskipTests -DskipITs deploy -DrepositoryId=apache.snapshots.https
[INFO] Scanning for projects...
[INFO] ------------------------------------------------------------------------
[INFO] Reactor Build Order:
[INFO] 
[INFO] stacks-validation-common
[INFO] smoke-tests-conf
[INFO] packagesmokes
[INFO] bigtop-smokes
[INFO]                                                                         
[INFO] ------------------------------------------------------------------------
[INFO] Building stacks-validation-common 1.1.0-SNAPSHOT
[INFO] ------------------------------------------------------------------------
[INFO] 
[INFO] --- maven-remote-resources-plugin:1.1:process (default) @ stacks-common ---
[INFO] Setting property: classpath.resource.loader.class => 'org.codehaus.plexus.velocity.ContextClassLoaderResourceLoader'.
[INFO] Setting property: velocimacro.messages.on => 'false'.
[INFO] Setting property: resource.loader => 'classpath'.
[INFO] Setting property: resource.manager.logwhenfound => 'false'.
[INFO] 
[INFO] --- maven-install-plugin:2.3:install (default-install) @ stacks-common ---
[INFO] Installing <https://builds.apache.org/job/Bigtop-trunk-test-execution/ws/bigtop-tests/test-execution/common/pom.xml>
to /home/jenkins/.m2/repository/org/apache/bigtop/itest/stacks-common/1.1.0-SNAPSHOT/stacks-common-1.1.0-SNAPSHOT.pom
[INFO] 
[INFO] --- maven-deploy-plugin:2.5:deploy (default-deploy) @ stacks-common ---
Downloading: https://repository.apache.org/content/repositories/snapshots/org/apache/bigtop/itest/stacks-common/1.1.0-SNAPSHOT/maven-metadata.xml

[WARNING] Could not transfer metadata org.apache.bigtop.itest:stacks-common:1.1.0-SNAPSHOT/maven-metadata.xml
from/to apache.snapshots.https (https://repository.apache.org/content/repositories/snapshots):
java.lang.RuntimeException: Could not generate DH keypair
[INFO] ------------------------------------------------------------------------
[INFO] Reactor Summary:
[INFO] 
[INFO] stacks-validation-common .......................... FAILURE [1.906s]
[INFO] smoke-tests-conf .................................. SKIPPED
[INFO] packagesmokes ..................................... SKIPPED
[INFO] bigtop-smokes ..................................... SKIPPED
[INFO] ------------------------------------------------------------------------
[INFO] BUILD FAILURE
[INFO] ------------------------------------------------------------------------
[INFO] Total time: 2.351s
[INFO] Finished at: Mon Aug 03 22:07:14 UTC 2015
[INFO] Final Memory: 9M/109M
[INFO] ------------------------------------------------------------------------
[ERROR] Failed to execute goal org.apache.maven.plugins:maven-deploy-plugin:2.5:deploy (default-deploy)
on project stacks-common: Failed to retrieve remote metadata org.apache.bigtop.itest:stacks-common:1.1.0-SNAPSHOT/maven-metadata.xml:
Could not transfer metadata org.apache.bigtop.itest:stacks-common:1.1.0-SNAPSHOT/maven-metadata.xml
from/to apache.snapshots.https (https://repository.apache.org/content/repositories/snapshots):
java.lang.RuntimeException: Could not generate DH keypair: Prime size must be multiple of
64, and can only range from 512 to 1024 (inclusive) -> [Help 1]
[ERROR] 
[ERROR] To see the full stack trace of the errors, re-run Maven with the -e switch.
[ERROR] Re-run Maven using the -X switch to enable full debug logging.
[ERROR] 
[ERROR] For more information about the errors and possible solutions, please read the following
articles:
[ERROR] [Help 1] http://cwiki.apache.org/confluence/display/MAVEN/MojoExecutionException
Build step 'Execute shell' marked build as failure

Mime
View raw message