bigtop-ci mailing list archives

Site index · List index
Message view « Date » · « Thread »
Top « Date » · « Thread »
From Apache Jenkins Server <jenk...@builds.apache.org>
Subject Build failed in Jenkins: Bigtop-trunk-test-execution #1635
Date Fri, 07 Aug 2015 21:01:18 GMT
See <https://builds.apache.org/job/Bigtop-trunk-test-execution/1635/changes>

Changes:

[cos] # BIGTOP-1809: ignite version upgraded 1.2.0 -> 1.3.0

[cos] Added workaround for problem IGNITE-1195

------------------------------------------
[...truncated 3315 lines...]
5584/6230 KB   
5588/6230 KB   
5592/6230 KB   
5593/6230 KB   
5596/6230 KB   
5600/6230 KB   
5604/6230 KB   
5604/6230 KB   
5608/6230 KB   
5608/6230 KB   
5610/6230 KB   
5614/6230 KB   
5614/6230 KB   
5617/6230 KB   
5621/6230 KB   
5621/6230 KB   
5625/6230 KB   
5625/6230 KB   
5629/6230 KB   
5630/6230 KB   
5634/6230 KB   
5634/6230 KB   
5638/6230 KB   
5638/6230 KB   
5642/6230 KB   
5642/6230 KB   
5646/6230 KB   
5646/6230 KB   
5650/6230 KB   
5651/6230 KB   
5655/6230 KB   
5655/6230 KB   
5659/6230 KB   
5659/6230 KB   
5663/6230 KB   
5663/6230 KB   
5667/6230 KB   
5669/6230 KB   
5673/6230 KB   
5675/6230 KB   
5679/6230 KB   
5680/6230 KB   
5684/6230 KB   
5686/6230 KB   
5690/6230 KB   
5692/6230 KB   
5696/6230 KB   
5697/6230 KB   
5701/6230 KB   
5702/6230 KB   
5706/6230 KB   
5709/6230 KB   
5713/6230 KB   
5716/6230 KB   
5720/6230 KB   
5723/6230 KB   
5727/6230 KB   
5730/6230 KB   
5734/6230 KB   
5737/6230 KB   
5741/6230 KB   
5744/6230 KB   
5748/6230 KB   
5751/6230 KB   
5755/6230 KB   
5759/6230 KB   
5760/6230 KB   
5764/6230 KB   
5768/6230 KB   
5768/6230 KB   
5772/6230 KB   
5774/6230 KB   
5777/6230 KB   
5781/6230 KB   
5782/6230 KB   
5786/6230 KB   
5786/6230 KB   
5790/6230 KB   
5792/6230 KB   
5796/6230 KB   
5796/6230 KB   
5800/6230 KB   
5801/6230 KB   
5805/6230 KB   
5806/6230 KB   
5810/6230 KB   
5811/6230 KB   
5815/6230 KB   
5818/6230 KB   
5822/6230 KB   
5822/6230 KB   
5826/6230 KB   
5829/6230 KB   
5833/6230 KB   
5833/6230 KB   
5837/6230 KB   
5841/6230 KB   
5844/6230 KB   
5848/6230 KB   
5852/6230 KB   
5856/6230 KB   
5857/6230 KB   
5861/6230 KB   
5865/6230 KB   
5869/6230 KB   
5870/6230 KB   
5873/6230 KB   
5877/6230 KB   
5881/6230 KB   
5884/6230 KB   
5888/6230 KB   
5891/6230 KB   
5895/6230 KB   
5898/6230 KB   
5902/6230 KB   
5904/6230 KB   
5908/6230 KB   
5912/6230 KB   
5914/6230 KB   
5918/6230 KB   
5919/6230 KB   
5923/6230 KB   
5924/6230 KB   
5928/6230 KB   
5932/6230 KB   
5935/6230 KB   
5939/6230 KB   
5941/6230 KB   
5945/6230 KB   
5949/6230 KB   
5953/6230 KB   
5956/6230 KB   
5960/6230 KB   
5963/6230 KB   
5967/6230 KB   
5971/6230 KB   
5975/6230 KB   
5979/6230 KB   
5983/6230 KB   
5986/6230 KB   
5990/6230 KB   
5993/6230 KB   
5997/6230 KB   
6000/6230 KB   
6004/6230 KB   
6008/6230 KB   
6012/6230 KB   
6016/6230 KB   
6020/6230 KB   
6024/6230 KB   
6028/6230 KB   
6032/6230 KB   
6036/6230 KB   
6040/6230 KB   
6044/6230 KB   
6048/6230 KB   
6052/6230 KB   
6056/6230 KB   
6060/6230 KB   
6064/6230 KB   
6068/6230 KB   
6072/6230 KB   
6076/6230 KB   
6080/6230 KB   
6084/6230 KB   
6088/6230 KB   
6092/6230 KB   
6096/6230 KB   
6100/6230 KB   
6104/6230 KB   
6108/6230 KB   
6112/6230 KB   
6116/6230 KB   
6120/6230 KB   
6124/6230 KB   
6128/6230 KB   
6132/6230 KB   
6136/6230 KB   
6140/6230 KB   
6144/6230 KB   
6148/6230 KB   
6152/6230 KB   
6156/6230 KB   
6160/6230 KB   
6164/6230 KB   
6168/6230 KB   
6172/6230 KB   
6176/6230 KB   
6180/6230 KB   
6184/6230 KB   
6188/6230 KB   
6192/6230 KB   
6196/6230 KB   
6200/6230 KB   
6204/6230 KB   
6208/6230 KB   
6212/6230 KB   
6216/6230 KB   
6220/6230 KB   
6224/6230 KB   
6228/6230 KB   
6230/6230 KB   
               
Downloaded: http://repo.maven.apache.org/maven2/org/codehaus/groovy/groovy-all/2.1.8/groovy-all-2.1.8.jar
(6230 KB at 3046.3 KB/sec)
[INFO] 
[INFO] --- maven-install-plugin:2.3:install (default-install) @ stacks-common ---
Downloading: http://repo.maven.apache.org/maven2/org/codehaus/plexus/plexus-digest/1.0/plexus-digest-1.0.pom
2/2 KB         
         
Downloaded: http://repo.maven.apache.org/maven2/org/codehaus/plexus/plexus-digest/1.0/plexus-digest-1.0.pom
(2 KB at 114.9 KB/sec)
Downloading: http://repo.maven.apache.org/maven2/org/codehaus/plexus/plexus-components/1.1.7/plexus-components-1.1.7.pom
4/5 KB   
5/5 KB   
         
Downloaded: http://repo.maven.apache.org/maven2/org/codehaus/plexus/plexus-components/1.1.7/plexus-components-1.1.7.pom
(5 KB at 539.8 KB/sec)
Downloading: http://repo.maven.apache.org/maven2/org/codehaus/plexus/plexus-digest/1.0/plexus-digest-1.0.jar
4/12 KB   
8/12 KB   
12/12 KB   
           
Downloaded: http://repo.maven.apache.org/maven2/org/codehaus/plexus/plexus-digest/1.0/plexus-digest-1.0.jar
(12 KB at 1286.7 KB/sec)
[INFO] Installing <https://builds.apache.org/job/Bigtop-trunk-test-execution/ws/bigtop-tests/test-execution/common/pom.xml>
to /home/jenkins/.m2/repository/org/apache/bigtop/itest/stacks-common/1.1.0-SNAPSHOT/stacks-common-1.1.0-SNAPSHOT.pom
[INFO] 
[INFO] --- maven-deploy-plugin:2.5:deploy (default-deploy) @ stacks-common ---
Downloading: https://repository.apache.org/content/repositories/snapshots/org/apache/bigtop/itest/stacks-common/1.1.0-SNAPSHOT/maven-metadata.xml
           
[WARNING] Could not transfer metadata org.apache.bigtop.itest:stacks-common:1.1.0-SNAPSHOT/maven-metadata.xml
from/to apache.snapshots.https (https://repository.apache.org/content/repositories/snapshots):
java.lang.RuntimeException: Could not generate DH keypair
[INFO] ------------------------------------------------------------------------
[INFO] Reactor Summary:
[INFO] 
[INFO] stacks-validation-common .......................... FAILURE [8.230s]
[INFO] smoke-tests-conf .................................. SKIPPED
[INFO] packagesmokes ..................................... SKIPPED
[INFO] bigtop-smokes ..................................... SKIPPED
[INFO] ------------------------------------------------------------------------
[INFO] BUILD FAILURE
[INFO] ------------------------------------------------------------------------
[INFO] Total time: 8.775s
[INFO] Finished at: Fri Aug 07 21:02:01 UTC 2015
[INFO] Final Memory: 8M/73M
[INFO] ------------------------------------------------------------------------
[ERROR] Failed to execute goal org.apache.maven.plugins:maven-deploy-plugin:2.5:deploy (default-deploy)
on project stacks-common: Failed to retrieve remote metadata org.apache.bigtop.itest:stacks-common:1.1.0-SNAPSHOT/maven-metadata.xml:
Could not transfer metadata org.apache.bigtop.itest:stacks-common:1.1.0-SNAPSHOT/maven-metadata.xml
from/to apache.snapshots.https (https://repository.apache.org/content/repositories/snapshots):
java.lang.RuntimeException: Could not generate DH keypair: Prime size must be multiple of
64, and can only range from 512 to 1024 (inclusive) -> [Help 1]
[ERROR] 
[ERROR] To see the full stack trace of the errors, re-run Maven with the -e switch.
[ERROR] Re-run Maven using the -X switch to enable full debug logging.
[ERROR] 
[ERROR] For more information about the errors and possible solutions, please read the following
articles:
[ERROR] [Help 1] http://cwiki.apache.org/confluence/display/MAVEN/MojoExecutionException
Build step 'Execute shell' marked build as failure

Mime
View raw message