bigtop-ci mailing list archives

Site index · List index
Message view « Date » · « Thread »
Top « Date » · « Thread »
From Apache Jenkins Server <jenk...@builds.apache.org>
Subject Build failed in Jenkins: Bigtop-trunk-test-execution #1542
Date Thu, 02 Apr 2015 14:46:29 GMT
See <https://builds.apache.org/job/Bigtop-trunk-test-execution/1542/changes>

Changes:

[of] BIGTOP-1635: hue compile on vanilla debian

------------------------------------------
[...truncated 401 lines...]
352/790 KB   
356/790 KB   
360/790 KB   
364/790 KB   
368/790 KB   
372/790 KB   
376/790 KB   
380/790 KB   
384/790 KB   
384/790 KB   
388/790 KB   
392/790 KB   
396/790 KB   
400/790 KB   
404/790 KB   
408/790 KB   
412/790 KB   
413/790 KB   
417/790 KB   
421/790 KB   
425/790 KB   
429/790 KB   
433/790 KB   
437/790 KB   
441/790 KB   
442/790 KB   
446/790 KB   
450/790 KB   
454/790 KB   
458/790 KB   
462/790 KB   
466/790 KB   
470/790 KB   
474/790 KB   
478/790 KB   
482/790 KB   
486/790 KB   
490/790 KB   
494/790 KB   
498/790 KB   
502/790 KB   
506/790 KB   
510/790 KB   
514/790 KB   
518/790 KB   
522/790 KB   
526/790 KB   
530/790 KB   
534/790 KB   
538/790 KB   
542/790 KB   
546/790 KB   
550/790 KB   
554/790 KB   
558/790 KB   
562/790 KB   
566/790 KB   
570/790 KB   
574/790 KB   
578/790 KB   
582/790 KB   
586/790 KB   
590/790 KB   
594/790 KB   
598/790 KB   
602/790 KB   
606/790 KB   
610/790 KB   
614/790 KB   
618/790 KB   
622/790 KB   
626/790 KB   
630/790 KB   
634/790 KB   
638/790 KB   
642/790 KB   
646/790 KB   
650/790 KB   
654/790 KB   
658/790 KB   
662/790 KB   
666/790 KB   
670/790 KB   
674/790 KB   
678/790 KB   
682/790 KB   
686/790 KB   
690/790 KB   
694/790 KB   
698/790 KB   
702/790 KB   
706/790 KB   
710/790 KB   
714/790 KB   
718/790 KB   
722/790 KB   
726/790 KB   
730/790 KB   
734/790 KB   
736/790 KB   
740/790 KB   
744/790 KB   
748/790 KB   
752/790 KB   
756/790 KB   
760/790 KB   
764/790 KB   
768/790 KB   
772/790 KB   
776/790 KB   
780/790 KB   
784/790 KB   
788/790 KB   
790/790 KB   
             
Downloaded: http://repository.apache.org/snapshots/org/apache/bigtop/itest/package-smoke/1.0.0-SNAPSHOT/package-smoke-1.0.0-20150402.053417-38.jar
(790 KB at 969.5 KB/sec)
[INFO] 
[INFO] --- maven-enforcer-plugin:1.0:enforce (enforce-property) @ package-smoke-execution
---
[INFO] 
[INFO] --- maven-remote-resources-plugin:1.1:process (default) @ package-smoke-execution ---
[INFO] 
[INFO] --- maven-resources-plugin:2.4:resources (default-resources) @ package-smoke-execution
---
[INFO] Using 'UTF-8' encoding to copy filtered resources.
[INFO] skip non existing resourceDirectory /x1/jenkins/jenkins-slave/workspace/Bigtop-trunk-test-execution/bigtop-tests/test-execution/package/src/main/resources
[INFO] Copying 3 resources
[INFO] 
[INFO] --- maven-compiler-plugin:2.0.2:compile (default-compile) @ package-smoke-execution
---
[INFO] No sources to compile
[INFO] 
[INFO] --- maven-dependency-plugin:2.1:copy (copy-testartifact-jar) @ package-smoke-execution
---
[INFO] Configured Artifact: org.apache.bigtop.itest:package-smoke:1.0.0-SNAPSHOT:jar
[INFO] Copying package-smoke-1.0.0-SNAPSHOT.jar to /x1/jenkins/jenkins-slave/workspace/Bigtop-trunk-test-execution/bigtop-tests/test-execution/package/target/package-smoke-1.0.0-SNAPSHOT.jar
[INFO] 
[INFO] --- maven-dependency-plugin:2.1:unpack (unpack-testartifact-jar) @ package-smoke-execution
---
[INFO] Configured Artifact: org.apache.bigtop.itest:package-smoke:1.0.0-SNAPSHOT:jar
[INFO] Unpacking /home/jenkins/.m2/repository/org/apache/bigtop/itest/package-smoke/1.0.0-SNAPSHOT/package-smoke-1.0.0-SNAPSHOT.jar
to
  /x1/jenkins/jenkins-slave/workspace/Bigtop-trunk-test-execution/bigtop-tests/test-execution/package/target
   with includes null and excludes:null
[INFO] 
[INFO] --- maven-resources-plugin:2.4:testResources (default-testResources) @ package-smoke-execution
---
[INFO] Using 'UTF-8' encoding to copy filtered resources.
[INFO] skip non existing resourceDirectory /x1/jenkins/jenkins-slave/workspace/Bigtop-trunk-test-execution/bigtop-tests/test-execution/package/src/test/resources
[INFO] Copying 3 resources
[INFO] 
[INFO] --- maven-compiler-plugin:2.0.2:testCompile (default-testCompile) @ package-smoke-execution
---
[INFO] No sources to compile
[INFO] 
[INFO] --- maven-surefire-plugin:2.11:test (default-test) @ package-smoke-execution ---
[INFO] Tests are skipped.
[INFO] 
[INFO] --- maven-jar-plugin:2.3:jar (default-jar) @ package-smoke-execution ---
[INFO] Building jar: /x1/jenkins/jenkins-slave/workspace/Bigtop-trunk-test-execution/bigtop-tests/test-execution/package/target/package-smoke-execution-1.0.0-SNAPSHOT.jar
[INFO] 
[INFO] --- gmaven-plugin:1.0:execute (check-testslist) @ package-smoke-execution ---
[INFO] 
[INFO] --- maven-failsafe-plugin:2.11:integration-test (integration-test) @ package-smoke-execution
---
[INFO] Tests are skipped.
[INFO] 
[INFO] --- maven-failsafe-plugin:2.11:verify (verify) @ package-smoke-execution ---
[INFO] Tests are skipped.
[INFO] 
[INFO] --- maven-install-plugin:2.3:install (default-install) @ package-smoke-execution ---
[INFO] Installing /x1/jenkins/jenkins-slave/workspace/Bigtop-trunk-test-execution/bigtop-tests/test-execution/package/target/package-smoke-execution-1.0.0-SNAPSHOT.jar
to /home/jenkins/.m2/repository/org/apache/bigtop/itest/package-smoke-execution/1.0.0-SNAPSHOT/package-smoke-execution-1.0.0-SNAPSHOT.jar
[INFO] Installing /x1/jenkins/jenkins-slave/workspace/Bigtop-trunk-test-execution/bigtop-tests/test-execution/package/pom.xml
to /home/jenkins/.m2/repository/org/apache/bigtop/itest/package-smoke-execution/1.0.0-SNAPSHOT/package-smoke-execution-1.0.0-SNAPSHOT.pom
[INFO] 
[INFO] --- maven-deploy-plugin:2.5:deploy (default-deploy) @ package-smoke-execution ---
Downloading: https://repository.apache.org/content/repositories/snapshots/org/apache/bigtop/itest/package-smoke-execution/1.0.0-SNAPSHOT/maven-metadata.xml
799/799 B    
            
Downloaded: https://repository.apache.org/content/repositories/snapshots/org/apache/bigtop/itest/package-smoke-execution/1.0.0-SNAPSHOT/maven-metadata.xml
(799 B at 0.1 KB/sec)
Uploading: https://repository.apache.org/content/repositories/snapshots/org/apache/bigtop/itest/package-smoke-execution/1.0.0-SNAPSHOT/package-smoke-execution-1.0.0-20150402.144055-21.jar
2/8 KB      
4/8 KB   
6/8 KB   
8/8 KB   
         
Uploaded: https://repository.apache.org/content/repositories/snapshots/org/apache/bigtop/itest/package-smoke-execution/1.0.0-SNAPSHOT/package-smoke-execution-1.0.0-20150402.144055-21.jar
(8 KB at 0.2 KB/sec)
Uploading: https://repository.apache.org/content/repositories/snapshots/org/apache/bigtop/itest/package-smoke-execution/1.0.0-SNAPSHOT/package-smoke-execution-1.0.0-20150402.144055-21.pom
2/4 KB   
4/4 KB   
         
Uploaded: https://repository.apache.org/content/repositories/snapshots/org/apache/bigtop/itest/package-smoke-execution/1.0.0-SNAPSHOT/package-smoke-execution-1.0.0-20150402.144055-21.pom
(4 KB at 0.2 KB/sec)
Downloading: https://repository.apache.org/content/repositories/snapshots/org/apache/bigtop/itest/package-smoke-execution/maven-metadata.xml
508/508 B   
            
Downloaded: https://repository.apache.org/content/repositories/snapshots/org/apache/bigtop/itest/package-smoke-execution/maven-metadata.xml
(508 B at 0.4 KB/sec)
Uploading: https://repository.apache.org/content/repositories/snapshots/org/apache/bigtop/itest/package-smoke-execution/1.0.0-SNAPSHOT/maven-metadata.xml
799/799 B   
            
Uploaded: https://repository.apache.org/content/repositories/snapshots/org/apache/bigtop/itest/package-smoke-execution/1.0.0-SNAPSHOT/maven-metadata.xml
(799 B at 0.0 KB/sec)
Uploading: https://repository.apache.org/content/repositories/snapshots/org/apache/bigtop/itest/package-smoke-execution/maven-metadata.xml
508/508 B   
            
Uploaded: https://repository.apache.org/content/repositories/snapshots/org/apache/bigtop/itest/package-smoke-execution/maven-metadata.xml
(508 B at 0.0 KB/sec)
[INFO]                                                                         
[INFO] ------------------------------------------------------------------------
[INFO] Building bigtop-smokes 1.0.0-SNAPSHOT
[INFO] ------------------------------------------------------------------------
[INFO] 
[INFO] --- maven-remote-resources-plugin:1.1:process (default) @ bigtop-test-execution ---
[INFO] 
[INFO] --- maven-install-plugin:2.3:install (default-install) @ bigtop-test-execution ---
[INFO] Installing /x1/jenkins/jenkins-slave/workspace/Bigtop-trunk-test-execution/bigtop-tests/test-execution/pom.xml
to /home/jenkins/.m2/repository/org/apache/bigtop/itest/bigtop-test-execution/1.0.0-SNAPSHOT/bigtop-test-execution-1.0.0-SNAPSHOT.pom
[INFO] 
[INFO] --- maven-deploy-plugin:2.5:deploy (default-deploy) @ bigtop-test-execution ---
Downloading: https://repository.apache.org/content/repositories/snapshots/org/apache/bigtop/itest/bigtop-test-execution/1.0.0-SNAPSHOT/maven-metadata.xml
623/623 B   
            
Downloaded: https://repository.apache.org/content/repositories/snapshots/org/apache/bigtop/itest/bigtop-test-execution/1.0.0-SNAPSHOT/maven-metadata.xml
(623 B at 0.2 KB/sec)
Uploading: https://repository.apache.org/content/repositories/snapshots/org/apache/bigtop/itest/bigtop-test-execution/1.0.0-SNAPSHOT/bigtop-test-execution-1.0.0-20150402.144329-21.pom
2/2 KB      
         
Uploaded: https://repository.apache.org/content/repositories/snapshots/org/apache/bigtop/itest/bigtop-test-execution/1.0.0-SNAPSHOT/bigtop-test-execution-1.0.0-20150402.144329-21.pom
(2 KB at 0.0 KB/sec)
Downloading: https://repository.apache.org/content/repositories/snapshots/org/apache/bigtop/itest/bigtop-test-execution/maven-metadata.xml
557/557 B   
            
Downloaded: https://repository.apache.org/content/repositories/snapshots/org/apache/bigtop/itest/bigtop-test-execution/maven-metadata.xml
(557 B at 0.1 KB/sec)
Uploading: https://repository.apache.org/content/repositories/snapshots/org/apache/bigtop/itest/bigtop-test-execution/1.0.0-SNAPSHOT/maven-metadata.xml
623/623 B   
            
Uploading: https://repository.apache.org/content/repositories/snapshots/org/apache/bigtop/itest/bigtop-test-execution/maven-metadata.xml
557/557 B   
            
Uploaded: https://repository.apache.org/content/repositories/snapshots/org/apache/bigtop/itest/bigtop-test-execution/maven-metadata.xml
(557 B at 0.0 KB/sec)
[INFO] ------------------------------------------------------------------------
[INFO] Reactor Summary:
[INFO] 
[INFO] stacks-validation-common .......................... SUCCESS [3:49.178s]
[INFO] smoke-tests-conf .................................. SUCCESS [3:11.995s]
[INFO] packagesmokes ..................................... SUCCESS [4:19.420s]
[INFO] bigtop-smokes ..................................... FAILURE [3:03.253s]
[INFO] ------------------------------------------------------------------------
[INFO] BUILD FAILURE
[INFO] ------------------------------------------------------------------------
[INFO] Total time: 14:24.212s
[INFO] Finished at: Thu Apr 02 14:46:29 UTC 2015
[INFO] Final Memory: 18M/87M
[INFO] ------------------------------------------------------------------------
[ERROR] Failed to execute goal org.apache.maven.plugins:maven-deploy-plugin:2.5:deploy (default-deploy)
on project bigtop-test-execution: Failed to deploy metadata: Could not transfer metadata org.apache.bigtop.itest:bigtop-test-execution:1.0.0-SNAPSHOT/maven-metadata.xml
from/to apache.snapshots.https (https://repository.apache.org/content/repositories/snapshots):
Failed to transfer file: https://repository.apache.org/content/repositories/snapshots/org/apache/bigtop/itest/bigtop-test-execution/1.0.0-SNAPSHOT/maven-metadata.xml.
Return code is: 502, ReasonPhrase:Proxy Error. -> [Help 1]
[ERROR] 
[ERROR] To see the full stack trace of the errors, re-run Maven with the -e switch.
[ERROR] Re-run Maven using the -X switch to enable full debug logging.
[ERROR] 
[ERROR] For more information about the errors and possible solutions, please read the following
articles:
[ERROR] [Help 1] http://cwiki.apache.org/confluence/display/MAVEN/MojoExecutionException
[ERROR] 
[ERROR] After correcting the problems, you can resume the build with the command
[ERROR]   mvn <goals> -rf :bigtop-test-execution
Build step 'Execute shell' marked build as failure

Mime
View raw message