bigtop-ci mailing list archives

Site index · List index
Message view « Date » · « Thread »
Top « Date » · « Thread »
From Apache Jenkins Server <jenk...@builds.apache.org>
Subject Build failed in Jenkins: Bigtop-trunk-iTest » iTest: system and integration testing in the cloud #2162
Date Tue, 31 Mar 2015 00:29:46 GMT
See <https://builds.apache.org/job/Bigtop-trunk-iTest/org.apache.bigtop.itest$itest-common/2162/>

------------------------------------------
[...truncated 152 lines...]
Downloaded: http://repo.maven.apache.org/maven2/org/apache/maven/shared/maven-shared-incremental/1.0/maven-shared-incremental-1.0.jar
(13 KB at 256.7 KB/sec)
Downloaded: http://repo.maven.apache.org/maven2/org/codehaus/plexus/plexus-compiler-javac/2.0/plexus-compiler-javac-2.0.jar
(19 KB at 409.7 KB/sec)
Downloading: http://nexus.codehaus.org/snapshots/org/codehaus/groovy/groovy-eclipse-batch/2.3.4-01-SNAPSHOT/groovy-eclipse-batch-2.3.4-01-20140710.184438-2.jar
Downloaded: http://nexus.codehaus.org/snapshots/org/codehaus/groovy/groovy-eclipse-batch/2.3.4-01-SNAPSHOT/groovy-eclipse-batch-2.3.4-01-20140710.184438-2.jar
(15336 KB at 6092.7 KB/sec)
[INFO]                                                                         
[INFO] ------------------------------------------------------------------------
[INFO] Building iTest: system and integration testing in the cloud 1.0.0-SNAPSHOT
[INFO] ------------------------------------------------------------------------
Downloading: http://repo.maven.apache.org/maven2/org/apache/maven/plugins/maven-failsafe-plugin/2.17/maven-failsafe-plugin-2.17.jar
Downloaded: http://repo.maven.apache.org/maven2/org/apache/maven/plugins/maven-failsafe-plugin/2.17/maven-failsafe-plugin-2.17.jar
(78 KB at 1842.0 KB/sec)
Downloading: http://repo.maven.apache.org/maven2/org/apache/maven/plugins/maven-resources-plugin/2.4/maven-resources-plugin-2.4.pom
Downloaded: http://repo.maven.apache.org/maven2/org/apache/maven/plugins/maven-resources-plugin/2.4/maven-resources-plugin-2.4.pom
(6 KB at 271.0 KB/sec)
Downloading: http://repo.maven.apache.org/maven2/org/apache/maven/plugins/maven-plugins/13/maven-plugins-13.pom
Downloaded: http://repo.maven.apache.org/maven2/org/apache/maven/plugins/maven-plugins/13/maven-plugins-13.pom
(12 KB at 548.0 KB/sec)
Downloading: http://repo.maven.apache.org/maven2/org/apache/maven/plugins/maven-resources-plugin/2.4/maven-resources-plugin-2.4.jar
Downloaded: http://repo.maven.apache.org/maven2/org/apache/maven/plugins/maven-resources-plugin/2.4/maven-resources-plugin-2.4.jar
(24 KB at 1133.8 KB/sec)
Downloading: http://repo.maven.apache.org/maven2/org/apache/maven/plugins/maven-surefire-plugin/2.7/maven-surefire-plugin-2.7.pom
Downloaded: http://repo.maven.apache.org/maven2/org/apache/maven/plugins/maven-surefire-plugin/2.7/maven-surefire-plugin-2.7.pom
(10 KB at 458.4 KB/sec)
Downloading: http://repo.maven.apache.org/maven2/org/apache/maven/surefire/surefire/2.7/surefire-2.7.pom
Downloaded: http://repo.maven.apache.org/maven2/org/apache/maven/surefire/surefire/2.7/surefire-2.7.pom
(9 KB at 424.4 KB/sec)
Downloading: http://repo.maven.apache.org/maven2/org/apache/maven/maven-parent/18/maven-parent-18.pom
Downloaded: http://repo.maven.apache.org/maven2/org/apache/maven/maven-parent/18/maven-parent-18.pom
(24 KB at 1070.2 KB/sec)
Downloading: http://repo.maven.apache.org/maven2/org/apache/maven/plugins/maven-surefire-plugin/2.7/maven-surefire-plugin-2.7.jar
Downloaded: http://repo.maven.apache.org/maven2/org/apache/maven/plugins/maven-surefire-plugin/2.7/maven-surefire-plugin-2.7.jar
(29 KB at 1338.6 KB/sec)
Downloading: http://repo.maven.apache.org/maven2/org/apache/maven/plugins/maven-install-plugin/2.3/maven-install-plugin-2.3.pom
Downloaded: http://repo.maven.apache.org/maven2/org/apache/maven/plugins/maven-install-plugin/2.3/maven-install-plugin-2.3.pom
(5 KB at 245.0 KB/sec)
Downloading: http://repo.maven.apache.org/maven2/org/apache/maven/plugins/maven-install-plugin/2.3/maven-install-plugin-2.3.jar
Downloaded: http://repo.maven.apache.org/maven2/org/apache/maven/plugins/maven-install-plugin/2.3/maven-install-plugin-2.3.jar
(23 KB at 1110.0 KB/sec)
Downloading: http://repo.maven.apache.org/maven2/org/apache/maven/plugins/maven-deploy-plugin/2.5/maven-deploy-plugin-2.5.pom
Downloaded: http://repo.maven.apache.org/maven2/org/apache/maven/plugins/maven-deploy-plugin/2.5/maven-deploy-plugin-2.5.pom
(6 KB at 278.7 KB/sec)
Downloading: http://repo.maven.apache.org/maven2/org/apache/maven/plugins/maven-plugins/16/maven-plugins-16.pom
Downloaded: http://repo.maven.apache.org/maven2/org/apache/maven/plugins/maven-plugins/16/maven-plugins-16.pom
(13 KB at 407.9 KB/sec)
Downloading: http://repo.maven.apache.org/maven2/org/apache/maven/plugins/maven-deploy-plugin/2.5/maven-deploy-plugin-2.5.jar
Downloaded: http://repo.maven.apache.org/maven2/org/apache/maven/plugins/maven-deploy-plugin/2.5/maven-deploy-plugin-2.5.jar
(23 KB at 1024.9 KB/sec)
Downloading: http://repo.maven.apache.org/maven2/org/codehaus/groovy/groovy-all/2.1.8/groovy-all-2.1.8.pom
Downloaded: http://repo.maven.apache.org/maven2/org/codehaus/groovy/groovy-all/2.1.8/groovy-all-2.1.8.pom
(18 KB at 800.6 KB/sec)
Downloading: http://repo.maven.apache.org/maven2/org/apache/ant/ant-junit/1.8.2/ant-junit-1.8.2.pom
Downloaded: http://repo.maven.apache.org/maven2/org/apache/ant/ant-junit/1.8.2/ant-junit-1.8.2.pom
(4 KB at 198.7 KB/sec)
Downloading: http://repo.maven.apache.org/maven2/org/codehaus/groovy/groovy-all/2.1.8/groovy-all-2.1.8.jar
Downloading: http://repo.maven.apache.org/maven2/org/apache/ant/ant-junit/1.8.2/ant-junit-1.8.2.jar
Downloaded: http://repo.maven.apache.org/maven2/org/apache/ant/ant-junit/1.8.2/ant-junit-1.8.2.jar
(100 KB at 2495.6 KB/sec)
Downloaded: http://repo.maven.apache.org/maven2/org/codehaus/groovy/groovy-all/2.1.8/groovy-all-2.1.8.jar
(6230 KB at 7478.5 KB/sec)
[INFO] 
[INFO] --- maven-clean-plugin:2.4.1:clean (default-clean) @ itest-common ---
[INFO] 
[INFO] --- groovy-eclipse-compiler:2.8.0-01:add-groovy-build-paths (default-add-groovy-build-paths)
@ itest-common ---
[INFO] Adding /src/main/groovy to the list of source folders
[INFO] Adding /src/test/groovy to the list of test source folders
[INFO] 
[INFO] --- maven-remote-resources-plugin:1.1:process (default) @ itest-common ---
Downloading: http://repo.maven.apache.org/maven2/org/apache/maven/reporting/maven-reporting-api/2.0.5/maven-reporting-api-2.0.5.jar
Downloaded: http://repo.maven.apache.org/maven2/org/apache/maven/reporting/maven-reporting-api/2.0.5/maven-reporting-api-2.0.5.jar
(10 KB at 485.4 KB/sec)
[INFO] Setting property: classpath.resource.loader.class => 'org.codehaus.plexus.velocity.ContextClassLoaderResourceLoader'.
[INFO] Setting property: velocimacro.messages.on => 'false'.
[INFO] Setting property: resource.loader => 'classpath'.
[INFO] Setting property: resource.manager.logwhenfound => 'false'.
[INFO] 
[INFO] --- maven-resources-plugin:2.4:resources (default-resources) @ itest-common ---
[INFO] Using 'UTF-8' encoding to copy filtered resources.
[INFO] skip non existing resourceDirectory <https://builds.apache.org/job/Bigtop-trunk-iTest/org.apache.bigtop.itest$itest-common/ws/src/main/resources>
[INFO] Copying 3 resources
[INFO] 
[INFO] --- maven-compiler-plugin:3.1:compile (default-compile) @ itest-common ---
Downloading: http://repo.maven.apache.org/maven2/org/codehaus/groovy/groovy-eclipse-batch/2.1.8-01/groovy-eclipse-batch-2.1.8-01.jar
Downloaded: http://repo.maven.apache.org/maven2/org/codehaus/groovy/groovy-eclipse-batch/2.1.8-01/groovy-eclipse-batch-2.1.8-01.jar
(13908 KB at 8128.3 KB/sec)
[INFO] Changes detected - recompiling the module!
[INFO] Using Groovy-Eclipse compiler to compile both Java and Groovy files
[INFO] 
[INFO] --- maven-resources-plugin:2.4:testResources (default-testResources) @ itest-common
---
[INFO] Using 'UTF-8' encoding to copy filtered resources.
[INFO] skip non existing resourceDirectory <https://builds.apache.org/job/Bigtop-trunk-iTest/org.apache.bigtop.itest$itest-common/ws/src/test/resources>
[INFO] Copying 3 resources
[INFO] 
[INFO] --- maven-compiler-plugin:3.1:testCompile (default-testCompile) @ itest-common ---
[INFO] Changes detected - recompiling the module!
[INFO] Using Groovy-Eclipse compiler to compile both Java and Groovy files
[INFO] 
[INFO] --- maven-surefire-plugin:2.7:test (default-test) @ itest-common ---
Downloading: http://repo.maven.apache.org/maven2/org/apache/maven/surefire/surefire-booter/2.7/surefire-booter-2.7.pom
Downloaded: http://repo.maven.apache.org/maven2/org/apache/maven/surefire/surefire-booter/2.7/surefire-booter-2.7.pom
(2 KB at 87.5 KB/sec)
Downloading: http://repo.maven.apache.org/maven2/org/apache/maven/surefire/surefire-api/2.7/surefire-api-2.7.pom
Downloaded: http://repo.maven.apache.org/maven2/org/apache/maven/surefire/surefire-api/2.7/surefire-api-2.7.pom
(2 KB at 95.8 KB/sec)
Downloading: http://repo.maven.apache.org/maven2/org/apache/maven/surefire/maven-surefire-common/2.7/maven-surefire-common-2.7.pom
Downloaded: http://repo.maven.apache.org/maven2/org/apache/maven/surefire/maven-surefire-common/2.7/maven-surefire-common-2.7.pom
(4 KB at 169.6 KB/sec)
Downloading: http://repo.maven.apache.org/maven2/org/apache/maven/surefire/surefire-booter/2.7/surefire-booter-2.7.jar
Downloading: http://repo.maven.apache.org/maven2/org/apache/maven/surefire/maven-surefire-common/2.7/maven-surefire-common-2.7.jar
Downloading: http://repo.maven.apache.org/maven2/org/apache/maven/surefire/surefire-api/2.7/surefire-api-2.7.jar
Downloaded: http://repo.maven.apache.org/maven2/org/apache/maven/surefire/surefire-booter/2.7/surefire-booter-2.7.jar
(34 KB at 1504.6 KB/sec)
Downloaded: http://repo.maven.apache.org/maven2/org/apache/maven/surefire/surefire-api/2.7/surefire-api-2.7.jar
(126 KB at 2982.4 KB/sec)
Downloaded: http://repo.maven.apache.org/maven2/org/apache/maven/surefire/maven-surefire-common/2.7/maven-surefire-common-2.7.jar
(56 KB at 1022.3 KB/sec)
[INFO] Surefire report directory: <https://builds.apache.org/job/Bigtop-trunk-iTest/org.apache.bigtop.itest$itest-common/ws/target/surefire-reports>
Downloading: http://repo.maven.apache.org/maven2/org/apache/maven/surefire/surefire-junit4/2.7/surefire-junit4-2.7.pom
Downloaded: http://repo.maven.apache.org/maven2/org/apache/maven/surefire/surefire-junit4/2.7/surefire-junit4-2.7.pom
(3 KB at 75.1 KB/sec)
Downloading: http://repo.maven.apache.org/maven2/org/apache/maven/surefire/surefire-providers/2.7/surefire-providers-2.7.pom
Downloaded: http://repo.maven.apache.org/maven2/org/apache/maven/surefire/surefire-providers/2.7/surefire-providers-2.7.pom
(2 KB at 52.0 KB/sec)
Downloading: http://repo.maven.apache.org/maven2/org/apache/maven/surefire/surefire-junit4/2.7/surefire-junit4-2.7.jar
Downloaded: http://repo.maven.apache.org/maven2/org/apache/maven/surefire/surefire-junit4/2.7/surefire-junit4-2.7.jar
(18 KB at 515.0 KB/sec)

-------------------------------------------------------
 T E S T S
-------------------------------------------------------
Running org.apache.bigtop.itest.shell.ShellTest
Tests run: 2, Failures: 0, Errors: 0, Skipped: 1, Time elapsed: 0.646 sec
Running org.apache.bigtop.itest.TestListUtilsTest
Tests run: 1, Failures: 0, Errors: 0, Skipped: 0, Time elapsed: 0.06 sec
Running org.apache.bigtop.itest.JUnitUtilsTest
Disclaimer: This test expected to show a failure in an embeded testcase
    [junit] Running org.apache.bigtop.itest.DummyTestPassTests run: 1, Failures: 0, Errors:
0, Time elapsed: 0.344 secRunning org.apache.bigtop.itest.DummyTestFail
    [junit] Tests run: 1, Failures: 1, Errors: 0, Time elapsed: 0.161 secTEST org.apache.bigtop.itest.DummyTestFail
FAILED
    [junit] Tests FAILED
Disclaimer: This test expected to show an error in an embeded testcase
    [junit] Running org.apache.bigtop.itest.DummyTestErrorTests run: 1, Failures: 0, Errors:
1, Time elapsed: 0.36 sec
    [junit] Test org.apache.bigtop.itest.DummyTestError FAILED
    [junit] Running org.apache.bigtop.itest.DummyTestPass
    [junit] Tests run: 1, Failures: 0, Errors: 0, Time elapsed: 0.341 sec
    [junit] Running org.apache.bigtop.itest.DummyTestPass
    [junit] Tests run: 1, Failures: 0, Errors: 0, Time elapsed: 0.342 sec
Tests run: 4, Failures: 0, Errors: 0, Skipped: 0, Time elapsed: 5.251 sec
Running org.apache.bigtop.itest.JarContentTest
log4j:WARN No appenders could be found for logger (org.apache.bigtop.itest.JarContent).
log4j:WARN Please initialize the log4j system properly.
Tests run: 6, Failures: 0, Errors: 0, Skipped: 0, Time elapsed: 1.087 sec
Running org.apache.bigtop.itest.TestContractJavaProc
Tests run: 2, Failures: 0, Errors: 0, Skipped: 0, Time elapsed: 0.003 sec
Running org.apache.bigtop.itest.posix.UGITest
Tests run: 2, Failures: 0, Errors: 0, Skipped: 0, Time elapsed: 0.037 sec
Running org.apache.bigtop.itest.posix.ServiceTest
Status []
Tests run: 2, Failures: 0, Errors: 0, Skipped: 1, Time elapsed: 0.082 sec
Running org.apache.bigtop.itest.posix.AlternativeTest
Tests run: 1, Failures: 0, Errors: 0, Skipped: 0, Time elapsed: 1.294 sec
Running org.apache.bigtop.itest.TestContractJava
Tests run: 2, Failures: 0, Errors: 0, Skipped: 0, Time elapsed: 0.002 sec
Running org.apache.bigtop.itest.pmanager.PackageManagerTest
/etc/cron.monthly/.placeholder
/etc/cron.hourly/.placeholder
/etc/default/cron
/etc/cron.weekly/.placeholder
/etc/cron.d/.placeholder
/etc/cron.daily/.placeholder
/etc/pam.d/cron
/etc/init/cron.conf
/etc/crontab
/.
/etc
/etc/cron.monthly
/etc/cron.monthly/.placeholder
/etc/cron.hourly
/etc/cron.hourly/.placeholder
/etc/default
/etc/default/cron
/etc/cron.weekly
/etc/cron.weekly/.placeholder
/etc/cron.d
/etc/cron.d/.placeholder
/etc/cron.daily
/etc/cron.daily/.placeholder
/etc/pam.d
/etc/pam.d/cron
/etc/init
/etc/init/cron.conf
/etc/init.d
/etc/crontab
/usr
/usr/share
/usr/share/bug
/usr/share/bug/cron
/usr/share/bug/cron/script
/usr/share/bug/cron/control
/usr/share/man
/usr/share/man/man1
/usr/share/man/man1/crontab.1.gz
/usr/share/man/man5
/usr/share/man/man5/crontab.5.gz
/usr/share/man/man8
/usr/share/man/man8/cron.8.gz
/usr/share/doc
/usr/share/doc/cron
/usr/share/doc/cron/README
/usr/share/doc/cron/README.anacron
/usr/share/doc/cron/README.Debian
/usr/share/doc/cron/FEATURES
/usr/share/doc/cron/copyright
/usr/share/doc/cron/examples
/usr/share/doc/cron/examples/crontab2english.pl
/usr/share/doc/cron/examples/cron-stats.pl
/usr/share/doc/cron/examples/cron-tasks-review.sh
/usr/share/doc/cron/NEWS.Debian.gz
/usr/share/doc/cron/changelog.Debian.gz
/usr/share/doc/cron/THANKS
/usr/share/doc/cron/TODO.Debian
/usr/sbin
/usr/sbin/cron
/usr/bin
/usr/bin/crontab
/var
/var/spool
/var/spool/cron
/var/spool/cron/crontabs
/etc/init.d/cron
Tests run: 11, Failures: 0, Errors: 0, Skipped: 3, Time elapsed: 12.057 sec
Running org.apache.bigtop.itest.junit.OrderedParameterizedTest
Tests run: 3, Failures: 0, Errors: 0, Skipped: 0, Time elapsed: 0.034 sec
Running org.apache.bigtop.itest.junit.OrderedTest
Tests run: 3, Failures: 0, Errors: 0, Skipped: 0, Time elapsed: 0.007 sec
Running org.apache.bigtop.itest.TestContractGroovy
Tests run: 2, Failures: 0, Errors: 0, Skipped: 0, Time elapsed: 0.008 sec

Results :

Tests run: 41, Failures: 0, Errors: 0, Skipped: 5

[JENKINS] Recording test results
log4j:WARN No appenders could be found for logger (org.apache.commons.beanutils.converters.BooleanConverter).
log4j:WARN Please initialize the log4j system properly.
[INFO] 
[INFO] --- maven-jar-plugin:2.2:jar (default-jar) @ itest-common ---
[INFO] Building jar: <https://builds.apache.org/job/Bigtop-trunk-iTest/org.apache.bigtop.itest$itest-common/ws/target/itest-common-1.0.0-SNAPSHOT.jar>
[INFO] 
[INFO] --- maven-jar-plugin:2.2:test-jar (default) @ itest-common ---
[INFO] Building jar: <https://builds.apache.org/job/Bigtop-trunk-iTest/org.apache.bigtop.itest$itest-common/ws/target/itest-common-1.0.0-SNAPSHOT-tests.jar>
[INFO] 
[INFO] --- maven-failsafe-plugin:2.17:verify (default) @ itest-common ---
[INFO] Tests are skipped.
[JENKINS] Recording test results
[INFO] 
[INFO] --- maven-install-plugin:2.3:install (default-install) @ itest-common ---
[INFO] Installing <https://builds.apache.org/job/Bigtop-trunk-iTest/org.apache.bigtop.itest$itest-common/ws/target/itest-common-1.0.0-SNAPSHOT.jar>
to /jenkins/maven-repositories/0/org/apache/bigtop/itest/itest-common/1.0.0-SNAPSHOT/itest-common-1.0.0-SNAPSHOT.jar
[INFO] Installing <https://builds.apache.org/job/Bigtop-trunk-iTest/org.apache.bigtop.itest$itest-common/ws/pom.xml>
to /jenkins/maven-repositories/0/org/apache/bigtop/itest/itest-common/1.0.0-SNAPSHOT/itest-common-1.0.0-SNAPSHOT.pom
[INFO] Installing <https://builds.apache.org/job/Bigtop-trunk-iTest/org.apache.bigtop.itest$itest-common/ws/target/itest-common-1.0.0-SNAPSHOT-tests.jar>
to /jenkins/maven-repositories/0/org/apache/bigtop/itest/itest-common/1.0.0-SNAPSHOT/itest-common-1.0.0-SNAPSHOT-tests.jar
[INFO] 
[INFO] --- maven-deploy-plugin:2.5:deploy (default-deploy) @ itest-common ---
Downloading: https://repository.apache.org/content/repositories/snapshots/org/apache/bigtop/itest/itest-common/1.0.0-SNAPSHOT/maven-metadata.xml
[WARNING] Could not transfer metadata org.apache.bigtop.itest:itest-common:1.0.0-SNAPSHOT/maven-metadata.xml
from/to apache.snapshots.https (https://repository.apache.org/content/repositories/snapshots):
java.lang.RuntimeException: Could not generate DH keypair
[INFO] ------------------------------------------------------------------------
[INFO] BUILD FAILURE
[INFO] ------------------------------------------------------------------------
[INFO] Total time: 1:13.220s
[INFO] Finished at: Tue Mar 31 00:29:44 UTC 2015
[INFO] Final Memory: 22M/242M
[INFO] ------------------------------------------------------------------------
Waiting for Jenkins to finish collecting data
[ERROR] Failed to execute goal org.apache.maven.plugins:maven-deploy-plugin:2.5:deploy (default-deploy)
on project itest-common: Failed to retrieve remote metadata org.apache.bigtop.itest:itest-common:1.0.0-SNAPSHOT/maven-metadata.xml:
Could not transfer metadata org.apache.bigtop.itest:itest-common:1.0.0-SNAPSHOT/maven-metadata.xml
from/to apache.snapshots.https (https://repository.apache.org/content/repositories/snapshots):
java.lang.RuntimeException: Could not generate DH keypair: Prime size must be multiple of
64, and can only range from 512 to 1024 (inclusive) -> [Help 1]
[ERROR] 
[ERROR] To see the full stack trace of the errors, re-run Maven with the -e switch.
[ERROR] Re-run Maven using the -X switch to enable full debug logging.
[ERROR] 
[ERROR] For more information about the errors and possible solutions, please read the following
articles:
[ERROR] [Help 1] http://cwiki.apache.org/confluence/display/MAVEN/MojoExecutionException

Mime
View raw message