bigtop-ci mailing list archives

Site index · List index
Message view « Date » · « Thread »
Top « Date » · « Thread »
From Apache Jenkins Server <jenk...@builds.apache.org>
Subject Build failed in Jenkins: Bigtop-trunk-testartifacts #1711
Date Fri, 06 Mar 2015 03:05:23 GMT
See <https://builds.apache.org/job/Bigtop-trunk-testartifacts/1711/>

------------------------------------------
[...truncated 438 lines...]
[INFO] 
[INFO] --- maven-clean-plugin:2.4.1:clean (default-clean) @ flume-smoke ---
[INFO] Deleting <https://builds.apache.org/job/Bigtop-trunk-testartifacts/ws/bigtop-tests/test-artifacts/flume/target>
[INFO] 
[INFO] --- groovy-eclipse-compiler:2.8.0-01:add-groovy-build-paths (default-add-groovy-build-paths)
@ flume-smoke ---
[INFO] Adding /src/main/groovy to the list of source folders
[INFO] Adding /src/test/groovy to the list of test source folders
[INFO] 
[INFO] --- maven-remote-resources-plugin:1.1:process (default) @ flume-smoke ---
[INFO] 
[INFO] --- maven-resources-plugin:2.4.3:resources (default-resources) @ flume-smoke ---
[INFO] Using 'UTF-8' encoding to copy filtered resources.
[INFO] Copying 4 resources
[INFO] Copying 3 resources
[INFO] 
[INFO] --- maven-compiler-plugin:3.1:compile (default-compile) @ flume-smoke ---
[INFO] Changes detected - recompiling the module!
[INFO] Using Groovy-Eclipse compiler to compile both Java and Groovy files
[INFO] 
[INFO] --- maven-resources-plugin:2.4.3:testResources (default-testResources) @ flume-smoke
---
[INFO] Using 'UTF-8' encoding to copy filtered resources.
[INFO] skip non existing resourceDirectory <https://builds.apache.org/job/Bigtop-trunk-testartifacts/ws/bigtop-tests/test-artifacts/flume/src/test/resources>
[INFO] Copying 3 resources
[INFO] 
[INFO] --- maven-compiler-plugin:3.1:testCompile (default-testCompile) @ flume-smoke ---
[INFO] No sources to compile
[INFO] 
[INFO] --- maven-surefire-plugin:2.7:test (default-test) @ flume-smoke ---
[INFO] Tests are skipped.
[INFO] 
[INFO] --- maven-jar-plugin:2.2:jar (default-jar) @ flume-smoke ---
[INFO] Building jar: <https://builds.apache.org/job/Bigtop-trunk-testartifacts/ws/bigtop-tests/test-artifacts/flume/target/flume-smoke-0.9.0-SNAPSHOT.jar>
[INFO] 
[INFO] --- maven-failsafe-plugin:2.7.1:integration-test (integration-test) @ flume-smoke ---
[INFO] No tests to run.
[JENKINS] Recording test results[INFO] 
[INFO] --- maven-failsafe-plugin:2.7.1:verify (verify) @ flume-smoke ---
[INFO] No tests to run.

[JENKINS] Recording test results[INFO] 
[INFO] --- maven-install-plugin:2.3:install (default-install) @ flume-smoke ---

[INFO] Installing <https://builds.apache.org/job/Bigtop-trunk-testartifacts/ws/bigtop-tests/test-artifacts/flume/target/flume-smoke-0.9.0-SNAPSHOT.jar>
to /home/jenkins/jenkins-slave/maven-repositories/0/org/apache/bigtop/itest/flume-smoke/0.9.0-SNAPSHOT/flume-smoke-0.9.0-SNAPSHOT.jar
[INFO] Installing <https://builds.apache.org/job/Bigtop-trunk-testartifacts/ws/bigtop-tests/test-artifacts/flume/pom.xml>
to /home/jenkins/jenkins-slave/maven-repositories/0/org/apache/bigtop/itest/flume-smoke/0.9.0-SNAPSHOT/flume-smoke-0.9.0-SNAPSHOT.pom
[INFO] 
[INFO] --- maven-deploy-plugin:2.5:deploy (default-deploy) @ flume-smoke ---
Downloading: https://repository.apache.org/content/repositories/snapshots/org/apache/bigtop/itest/flume-smoke/0.9.0-SNAPSHOT/maven-metadata.xml
Downloaded: https://repository.apache.org/content/repositories/snapshots/org/apache/bigtop/itest/flume-smoke/0.9.0-SNAPSHOT/maven-metadata.xml
(790 B at 24.9 KB/sec)
Uploading: https://repository.apache.org/content/repositories/snapshots/org/apache/bigtop/itest/flume-smoke/0.9.0-SNAPSHOT/flume-smoke-0.9.0-20150306.030439-188.jar
Uploaded: https://repository.apache.org/content/repositories/snapshots/org/apache/bigtop/itest/flume-smoke/0.9.0-SNAPSHOT/flume-smoke-0.9.0-20150306.030439-188.jar
(40 KB at 862.5 KB/sec)
Uploading: https://repository.apache.org/content/repositories/snapshots/org/apache/bigtop/itest/flume-smoke/0.9.0-SNAPSHOT/flume-smoke-0.9.0-20150306.030439-188.pom
Uploaded: https://repository.apache.org/content/repositories/snapshots/org/apache/bigtop/itest/flume-smoke/0.9.0-SNAPSHOT/flume-smoke-0.9.0-20150306.030439-188.pom
(2 KB at 37.7 KB/sec)
Downloading: https://repository.apache.org/content/repositories/snapshots/org/apache/bigtop/itest/flume-smoke/maven-metadata.xml
Downloaded: https://repository.apache.org/content/repositories/snapshots/org/apache/bigtop/itest/flume-smoke/maven-metadata.xml
(405 B at 23.3 KB/sec)
Uploading: https://repository.apache.org/content/repositories/snapshots/org/apache/bigtop/itest/flume-smoke/0.9.0-SNAPSHOT/maven-metadata.xml
Uploaded: https://repository.apache.org/content/repositories/snapshots/org/apache/bigtop/itest/flume-smoke/0.9.0-SNAPSHOT/maven-metadata.xml
(790 B at 21.4 KB/sec)
Uploading: https://repository.apache.org/content/repositories/snapshots/org/apache/bigtop/itest/flume-smoke/maven-metadata.xml
Uploaded: https://repository.apache.org/content/repositories/snapshots/org/apache/bigtop/itest/flume-smoke/maven-metadata.xml
(405 B at 10.1 KB/sec)
[INFO]                                                                         
[INFO] ------------------------------------------------------------------------
[INFO] Building sqoopsmokes 0.9.0-SNAPSHOT
[INFO] ------------------------------------------------------------------------
Downloading: http://repo.maven.apache.org/maven2/org/apache/sqoop/sqoop-core/1.4.5/sqoop-core-1.4.5.pom
[WARNING] The POM for org.apache.sqoop:sqoop-core:jar:1.4.5 is missing, no dependency information
available
Downloading: http://repo.maven.apache.org/maven2/org/apache/sqoop/sqoop-client/1.4.5/sqoop-client-1.4.5.pom
[WARNING] The POM for org.apache.sqoop:sqoop-client:jar:1.4.5 is missing, no dependency information
available
Downloading: http://repo.maven.apache.org/maven2/org/apache/sqoop/sqoop-core/1.4.5/sqoop-core-1.4.5.jar
Downloading: http://repo.maven.apache.org/maven2/org/apache/sqoop/sqoop-client/1.4.5/sqoop-client-1.4.5.jar
[INFO] ------------------------------------------------------------------------
[INFO] Reactor Summary:
[INFO] 
[INFO] bigtop-smokes ..................................... SUCCESS [16.834s]
[INFO] hadoopsmoke ....................................... SUCCESS [26.304s]
[INFO] packagesmoke ...................................... SUCCESS [10.819s]
[INFO] httpfssmokes ...................................... SUCCESS [0.868s]
[INFO] ooziesmoke ........................................ SUCCESS [1.201s]
[INFO] hbasesmoke ........................................ SUCCESS [12.136s]
[INFO] flumesmoke ........................................ SUCCESS [1.448s]
[INFO] sqoopsmokes ....................................... FAILURE [0.233s]
[INFO] mahoutsmoke ....................................... SKIPPED
[INFO] giraphsmoke ....................................... SKIPPED
[INFO] huesmoke .......................................... SKIPPED
[INFO] solrsmoke ......................................... SKIPPED
[INFO] crunchsmoke ....................................... SKIPPED
[INFO] datafusmoke ....................................... SKIPPED
[INFO] io-longevity ...................................... SKIPPED
[INFO] hcatalogsmoke ..................................... SKIPPED
[INFO] sparksmoke ........................................ SKIPPED
[INFO] phoenixsmoke ...................................... SKIPPED
[INFO] fatjar ............................................ SKIPPED
[INFO] ------------------------------------------------------------------------
[INFO] BUILD FAILURE
[INFO] ------------------------------------------------------------------------
[INFO] Total time: 1:17.128s
[INFO] Finished at: Fri Mar 06 03:04:40 UTC 2015
[INFO] Final Memory: 31M/278M
[INFO] ------------------------------------------------------------------------
Waiting for Jenkins to finish collecting data
[ERROR] Failed to execute goal on project sqoop-smoke: Could not resolve dependencies for
project org.apache.bigtop.itest:sqoop-smoke:jar:0.9.0-SNAPSHOT: The following artifacts could
not be resolved: org.apache.sqoop:sqoop-core:jar:1.4.5, org.apache.sqoop:sqoop-client:jar:1.4.5:
Could not find artifact org.apache.sqoop:sqoop-core:jar:1.4.5 in central (http://repo.maven.apache.org/maven2)
-> [Help 1]
[ERROR] 
[ERROR] To see the full stack trace of the errors, re-run Maven with the -e switch.
[ERROR] Re-run Maven using the -X switch to enable full debug logging.
[ERROR] 
[ERROR] For more information about the errors and possible solutions, please read the following
articles:
[ERROR] [Help 1] http://cwiki.apache.org/confluence/display/MAVEN/DependencyResolutionException
[ERROR] 
[ERROR] After correcting the problems, you can resume the build with the command
[ERROR]   mvn <goals> -rf :sqoop-smoke
[JENKINS] Archiving <https://builds.apache.org/job/Bigtop-trunk-testartifacts/ws/bigtop-tests/test-artifacts/pom.xml>
to org.apache.bigtop.itest/bigtop-smokes/0.9.0-SNAPSHOT/bigtop-smokes-0.9.0-SNAPSHOT.pom
Sending artifact delta relative to Bigtop-trunk-testartifacts ? bigtop-smokes #1710
Archived 1 artifacts
Archive block size is 32768
Received 0 blocks and 4894 bytes
Compression is 0.0%
Took 95 ms
[JENKINS] Archiving <https://builds.apache.org/job/Bigtop-trunk-testartifacts/ws/bigtop-tests/test-artifacts/sqoop/pom.xml>
to org.apache.bigtop.itest/sqoop-smoke/0.9.0-SNAPSHOT/sqoop-smoke-0.9.0-SNAPSHOT.pom
Sending artifact delta relative to Bigtop-trunk-testartifacts ? sqoopsmokes #1707
Archived 1 artifacts
Archive block size is 32768
Received 0 blocks and 1837 bytes
Compression is 0.0%
Took 36 ms
[JENKINS] Archiving <https://builds.apache.org/job/Bigtop-trunk-testartifacts/ws/bigtop-tests/test-artifacts/hue/pom.xml>
to org.apache.bigtop.itest/hue-smoke/0.9.0-SNAPSHOT/hue-smoke-0.9.0-SNAPSHOT.pom
Sending artifact delta relative to Bigtop-trunk-testartifacts ? huesmoke #1707
Archived 1 artifacts
Archive block size is 32768
Received 0 blocks and 1510 bytes
Compression is 0.0%
Took 43 ms
[JENKINS] Archiving <https://builds.apache.org/job/Bigtop-trunk-testartifacts/ws/bigtop-tests/test-artifacts/crunch/pom.xml>
to org.apache.bigtop.itest/crunch-smoke/0.9.0-SNAPSHOT/crunch-smoke-0.9.0-SNAPSHOT.pom
Sending artifact delta relative to Bigtop-trunk-testartifacts ? crunchsmoke #1707
Archived 1 artifacts
Archive block size is 32768
Received 0 blocks and 1521 bytes
Compression is 0.0%
Took 86 ms
[JENKINS] Archiving <https://builds.apache.org/job/Bigtop-trunk-testartifacts/ws/bigtop-tests/test-artifacts/package/pom.xml>
to org.apache.bigtop.itest/package-smoke/0.9.0-SNAPSHOT/package-smoke-0.9.0-SNAPSHOT.pom
[JENKINS] Archiving <https://builds.apache.org/job/Bigtop-trunk-testartifacts/ws/bigtop-tests/test-artifacts/package/target/package-smoke-0.9.0-SNAPSHOT.jar>
to org.apache.bigtop.itest/package-smoke/0.9.0-20150306.030422-188/package-smoke-0.9.0-20150306.030422-188.jar
Sending artifact delta relative to Bigtop-trunk-testartifacts ? packagesmoke #1710
Archived 2 artifacts
Archive block size is 32768
Received 1 blocks and 778280 bytes
Compression is 4.0%
Took 0.41 sec
[JENKINS] Archiving <https://builds.apache.org/job/Bigtop-trunk-testartifacts/ws/bigtop-tests/test-artifacts/flume/pom.xml>
to org.apache.bigtop.itest/flume-smoke/0.9.0-SNAPSHOT/flume-smoke-0.9.0-SNAPSHOT.pom
[JENKINS] Archiving <https://builds.apache.org/job/Bigtop-trunk-testartifacts/ws/bigtop-tests/test-artifacts/flume/target/flume-smoke-0.9.0-SNAPSHOT.jar>
to org.apache.bigtop.itest/flume-smoke/0.9.0-20150306.030439-188/flume-smoke-0.9.0-20150306.030439-188.jar
Sending artifact delta relative to Bigtop-trunk-testartifacts ? flumesmoke #1710
Archived 2 artifacts
Archive block size is 32768
Received 0 blocks and 42418 bytes
Compression is 0.0%
Took 80 ms
[JENKINS] Archiving <https://builds.apache.org/job/Bigtop-trunk-testartifacts/ws/bigtop-tests/test-artifacts/httpfs/pom.xml>
to org.apache.bigtop.itest/httpfs-smoke/0.9.0-SNAPSHOT/httpfs-smoke-0.9.0-SNAPSHOT.pom
[JENKINS] Archiving <https://builds.apache.org/job/Bigtop-trunk-testartifacts/ws/bigtop-tests/test-artifacts/httpfs/target/httpfs-smoke-0.9.0-SNAPSHOT.jar>
to org.apache.bigtop.itest/httpfs-smoke/0.9.0-20150306.030423-188/httpfs-smoke-0.9.0-20150306.030423-188.jar
Sending artifact delta relative to Bigtop-trunk-testartifacts ? httpfssmokes #1710
Archived 2 artifacts
Archive block size is 32768
Received 0 blocks and 17690 bytes
Compression is 0.0%
Took 43 ms
[JENKINS] Archiving <https://builds.apache.org/job/Bigtop-trunk-testartifacts/ws/bigtop-tests/test-artifacts/spark/pom.xml>
to org.apache.bigtop.itest/spark-smoke/0.9.0-SNAPSHOT/spark-smoke-0.9.0-SNAPSHOT.pom
Sending artifact delta relative to Bigtop-trunk-testartifacts ? sparksmoke #1707
Archived 1 artifacts
Archive block size is 32768
Received 0 blocks and 2266 bytes
Compression is 0.0%
Took 42 ms
[JENKINS] Archiving <https://builds.apache.org/job/Bigtop-trunk-testartifacts/ws/bigtop-tests/test-artifacts/hadoop/pom.xml>
to org.apache.bigtop.itest/hadoop-smoke/0.9.0-SNAPSHOT/hadoop-smoke-0.9.0-SNAPSHOT.pom
[JENKINS] Archiving <https://builds.apache.org/job/Bigtop-trunk-testartifacts/ws/bigtop-tests/test-artifacts/hadoop/target/hadoop-smoke-0.9.0-SNAPSHOT.jar>
to org.apache.bigtop.itest/hadoop-smoke/0.9.0-20150306.030411-188/hadoop-smoke-0.9.0-20150306.030411-188.jar
Sending artifact delta relative to Bigtop-trunk-testartifacts ? hadoopsmoke #1710
Archived 2 artifacts
Archive block size is 32768
Received 2 blocks and 270706 bytes
Compression is 19.5%
Took 0.23 sec
[JENKINS] Archiving <https://builds.apache.org/job/Bigtop-trunk-testartifacts/ws/bigtop-tests/test-artifacts/oozie/pom.xml>
to org.apache.bigtop.itest/oozie-smoke/0.9.0-SNAPSHOT/oozie-smoke-0.9.0-SNAPSHOT.pom
[JENKINS] Archiving <https://builds.apache.org/job/Bigtop-trunk-testartifacts/ws/bigtop-tests/test-artifacts/oozie/target/oozie-smoke-0.9.0-SNAPSHOT.jar>
to org.apache.bigtop.itest/oozie-smoke/0.9.0-20150306.030425-188/oozie-smoke-0.9.0-20150306.030425-188.jar
Sending artifact delta relative to Bigtop-trunk-testartifacts ? ooziesmoke #1710
Archived 2 artifacts
Archive block size is 32768
Received 0 blocks and 16599 bytes
Compression is 0.0%
Took 62 ms
[JENKINS] Archiving <https://builds.apache.org/job/Bigtop-trunk-testartifacts/ws/bigtop-tests/test-artifacts/giraph/pom.xml>
to org.apache.bigtop.itest/giraph-smoke/0.9.0-SNAPSHOT/giraph-smoke-0.9.0-SNAPSHOT.pom
Sending artifact delta relative to Bigtop-trunk-testartifacts ? giraphsmoke #1707
Archived 1 artifacts
Archive block size is 32768
Received 0 blocks and 1522 bytes
Compression is 0.0%
Took 26 ms
[JENKINS] Archiving <https://builds.apache.org/job/Bigtop-trunk-testartifacts/ws/bigtop-tests/test-artifacts/hcatalog/pom.xml>
to org.apache.bigtop.itest/hcatalog-smoke/0.9.0-SNAPSHOT/hcatalog-smoke-0.9.0-SNAPSHOT.pom
Sending artifact delta relative to Bigtop-trunk-testartifacts ? hcatalogsmoke #1707
Archived 1 artifacts
Archive block size is 32768
Received 0 blocks and 1529 bytes
Compression is 0.0%
Took 30 ms
[JENKINS] Archiving <https://builds.apache.org/job/Bigtop-trunk-testartifacts/ws/bigtop-tests/test-artifacts/datafu/pom.xml>
to org.apache.bigtop.itest/datafu-smoke/0.9.0-SNAPSHOT/datafu-smoke-0.9.0-SNAPSHOT.pom
Sending artifact delta relative to Bigtop-trunk-testartifacts ? datafusmoke #1707
Archived 1 artifacts
Archive block size is 32768
Received 0 blocks and 2405 bytes
Compression is 0.0%
Took 24 ms
[JENKINS] Archiving <https://builds.apache.org/job/Bigtop-trunk-testartifacts/ws/bigtop-tests/test-artifacts/longevity/pom.xml>
to org.apache.bigtop.itest/io-longevity/0.9.0-SNAPSHOT/io-longevity-0.9.0-SNAPSHOT.pom
Sending artifact delta relative to Bigtop-trunk-testartifacts ? io-longevity #1707
Archived 1 artifacts
Archive block size is 32768
Received 0 blocks and 1699 bytes
Compression is 0.0%
Took 7 ms
[JENKINS] Archiving <https://builds.apache.org/job/Bigtop-trunk-testartifacts/ws/bigtop-tests/test-artifacts/mahout/pom.xml>
to org.apache.bigtop.itest/mahout-smoke/0.9.0-SNAPSHOT/mahout-smoke-0.9.0-SNAPSHOT.pom
Sending artifact delta relative to Bigtop-trunk-testartifacts ? mahoutsmoke #1707
Archived 1 artifacts
Archive block size is 32768
Received 0 blocks and 1522 bytes
Compression is 0.0%
Took 16 ms
[JENKINS] Archiving <https://builds.apache.org/job/Bigtop-trunk-testartifacts/ws/bigtop-tests/test-artifacts/hbase/pom.xml>
to org.apache.bigtop.itest/hbase-smoke/0.9.0-SNAPSHOT/hbase-smoke-0.9.0-SNAPSHOT.pom
[JENKINS] Archiving <https://builds.apache.org/job/Bigtop-trunk-testartifacts/ws/bigtop-tests/test-artifacts/hbase/target/hbase-smoke-0.9.0-SNAPSHOT.jar>
to org.apache.bigtop.itest/hbase-smoke/0.9.0-20150306.030437-188/hbase-smoke-0.9.0-20150306.030437-188.jar
Sending artifact delta relative to Bigtop-trunk-testartifacts ? hbasesmoke #1710
Archived 2 artifacts
Archive block size is 32768
Received 0 blocks and 184774 bytes
Compression is 0.0%
Took 0.13 sec
[JENKINS] Archiving <https://builds.apache.org/job/Bigtop-trunk-testartifacts/ws/bigtop-tests/test-artifacts/solr/pom.xml>
to org.apache.bigtop.itest/solr-smoke/0.9.0-SNAPSHOT/solr-smoke-0.9.0-SNAPSHOT.pom
Sending artifact delta relative to Bigtop-trunk-testartifacts ? solrsmoke #1707
Archived 1 artifacts
Archive block size is 32768
Received 0 blocks and 1784 bytes
Compression is 0.0%
Took 26 ms
[JENKINS] Archiving <https://builds.apache.org/job/Bigtop-trunk-testartifacts/ws/bigtop-tests/test-artifacts/phoenix/pom.xml>
to org.apache.bigtop.itest/phoenix-smoke/0.9.0-SNAPSHOT/phoenix-smoke-0.9.0-SNAPSHOT.pom
Sending artifact delta relative to Bigtop-trunk-testartifacts ? phoenixsmoke #1707
Archived 1 artifacts
Archive block size is 32768
Received 0 blocks and 1526 bytes
Compression is 0.0%
Took 41 ms
[JENKINS] Archiving <https://builds.apache.org/job/Bigtop-trunk-testartifacts/ws/bigtop-tests/test-artifacts/fatjar/pom.xml>
to org.apache.bigtop.itest/fat-smoke/0.9.0-SNAPSHOT/fat-smoke-0.9.0-SNAPSHOT.pom
Sending artifact delta relative to Bigtop-trunk-testartifacts ? fatjar #1707
Archived 1 artifacts
Archive block size is 32768
Received 0 blocks and 5446 bytes
Compression is 0.0%
Took 24 sec
Sending e-mails to: ci@bigtop.apache.org
channel stopped

Mime
View raw message