bigtop-ci mailing list archives

Site index · List index
Message view « Date » · « Thread »
Top « Date » · « Thread »
From Apache Jenkins Server <jenk...@builds.apache.org>
Subject Build failed in Jenkins: Bigtop-trunk-iTest » iTest: system and integration testing in the cloud #2002
Date Thu, 29 Jan 2015 00:46:16 GMT
See <https://builds.apache.org/job/Bigtop-trunk-iTest/org.apache.bigtop.itest$itest-common/2002/>

------------------------------------------
maven3-agent.jar already up to date
maven3-interceptor.jar already up to date
maven3-interceptor-commons.jar already up to date
<===[JENKINS REMOTING CAPACITY]===>   channel started
Executing Maven:  -B -f <https://builds.apache.org/job/Bigtop-trunk-iTest/org.apache.bigtop.itest$itest-common/ws/pom.xml>
-Dmaven.repo.local=/home/jenkins/jenkins-slave/maven-repositories/1 deploy
[INFO] Scanning for projects...
Downloading: http://nexus.codehaus.org/snapshots/org/codehaus/groovy/groovy-eclipse-batch/maven-metadata.xml
Downloading: http://repository.codehaus.org/org/codehaus/groovy/groovy-eclipse-batch/maven-metadata.xml
Downloaded: http://repository.codehaus.org/org/codehaus/groovy/groovy-eclipse-batch/maven-metadata.xml
(2 KB at 3.2 KB/sec)
Downloaded: http://nexus.codehaus.org/snapshots/org/codehaus/groovy/groovy-eclipse-batch/maven-metadata.xml
(599 B at 1.4 KB/sec)
Downloading: http://repository.codehaus.org/org/codehaus/groovy/groovy-eclipse-batch/2.1.8-01-SNAPSHOT/maven-metadata.xml
Downloading: http://nexus.codehaus.org/snapshots/org/codehaus/groovy/groovy-eclipse-batch/2.1.8-01-SNAPSHOT/maven-metadata.xml
Downloaded: http://nexus.codehaus.org/snapshots/org/codehaus/groovy/groovy-eclipse-batch/2.1.8-01-SNAPSHOT/maven-metadata.xml
(798 B at 3.1 KB/sec)
Downloading: http://repository.codehaus.org/org/codehaus/groovy/groovy-eclipse-batch/2.2.1-01-SNAPSHOT/maven-metadata.xml
Downloading: http://nexus.codehaus.org/snapshots/org/codehaus/groovy/groovy-eclipse-batch/2.2.1-01-SNAPSHOT/maven-metadata.xml
Downloaded: http://nexus.codehaus.org/snapshots/org/codehaus/groovy/groovy-eclipse-batch/2.2.1-01-SNAPSHOT/maven-metadata.xml
(2 KB at 4.9 KB/sec)
Downloading: http://repository.codehaus.org/org/codehaus/groovy/groovy-eclipse-batch/2.3.0-01-SNAPSHOT/maven-metadata.xml
Downloading: http://nexus.codehaus.org/snapshots/org/codehaus/groovy/groovy-eclipse-batch/2.3.0-01-SNAPSHOT/maven-metadata.xml
Downloaded: http://nexus.codehaus.org/snapshots/org/codehaus/groovy/groovy-eclipse-batch/2.3.0-01-SNAPSHOT/maven-metadata.xml
(2 KB at 5.0 KB/sec)
Downloading: http://repository.codehaus.org/org/codehaus/groovy/groovy-eclipse-batch/2.3.1-01-SNAPSHOT/maven-metadata.xml
Downloading: http://nexus.codehaus.org/snapshots/org/codehaus/groovy/groovy-eclipse-batch/2.3.1-01-SNAPSHOT/maven-metadata.xml
Downloaded: http://nexus.codehaus.org/snapshots/org/codehaus/groovy/groovy-eclipse-batch/2.3.1-01-SNAPSHOT/maven-metadata.xml
(2 KB at 4.8 KB/sec)
Downloading: http://repository.codehaus.org/org/codehaus/groovy/groovy-eclipse-batch/2.3.2-01-SNAPSHOT/maven-metadata.xml
Downloading: http://nexus.codehaus.org/snapshots/org/codehaus/groovy/groovy-eclipse-batch/2.3.2-01-SNAPSHOT/maven-metadata.xml
Downloaded: http://nexus.codehaus.org/snapshots/org/codehaus/groovy/groovy-eclipse-batch/2.3.2-01-SNAPSHOT/maven-metadata.xml
(2 KB at 4.9 KB/sec)
Downloading: http://repository.codehaus.org/org/codehaus/groovy/groovy-eclipse-batch/2.3.3-01-SNAPSHOT/maven-metadata.xml
Downloading: http://nexus.codehaus.org/snapshots/org/codehaus/groovy/groovy-eclipse-batch/2.3.3-01-SNAPSHOT/maven-metadata.xml
Downloaded: http://nexus.codehaus.org/snapshots/org/codehaus/groovy/groovy-eclipse-batch/2.3.3-01-SNAPSHOT/maven-metadata.xml
(2 KB at 4.9 KB/sec)
Downloading: http://repository.codehaus.org/org/codehaus/groovy/groovy-eclipse-batch/2.3.4-01-SNAPSHOT/maven-metadata.xml
Downloading: http://nexus.codehaus.org/snapshots/org/codehaus/groovy/groovy-eclipse-batch/2.3.4-01-SNAPSHOT/maven-metadata.xml
Downloaded: http://nexus.codehaus.org/snapshots/org/codehaus/groovy/groovy-eclipse-batch/2.3.4-01-SNAPSHOT/maven-metadata.xml
(378 B at 1.5 KB/sec)
[INFO]                                                                         
[INFO] ------------------------------------------------------------------------
[INFO] Building iTest: system and integration testing in the cloud 0.9.0-SNAPSHOT
[INFO] ------------------------------------------------------------------------
[INFO] 
[INFO] --- groovy-eclipse-compiler:2.8.0-01:add-groovy-build-paths (default-add-groovy-build-paths)
@ itest-common ---
[INFO] Adding /src/main/groovy to the list of source folders
[INFO] Adding /src/test/groovy to the list of test source folders
[INFO] 
[INFO] --- maven-remote-resources-plugin:1.1:process (default) @ itest-common ---
[INFO] Setting property: classpath.resource.loader.class => 'org.codehaus.plexus.velocity.ContextClassLoaderResourceLoader'.
[INFO] Setting property: velocimacro.messages.on => 'false'.
[INFO] Setting property: resource.loader => 'classpath'.
[INFO] Setting property: resource.manager.logwhenfound => 'false'.
[INFO] 
[INFO] --- maven-resources-plugin:2.4:resources (default-resources) @ itest-common ---
[INFO] Using 'UTF-8' encoding to copy filtered resources.
[INFO] skip non existing resourceDirectory <https://builds.apache.org/job/Bigtop-trunk-iTest/org.apache.bigtop.itest$itest-common/ws/src/main/resources>
[INFO] Copying 3 resources
[INFO] 
[INFO] --- maven-compiler-plugin:3.1:compile (default-compile) @ itest-common ---
[INFO] Changes detected - recompiling the module!
[INFO] Using Groovy-Eclipse compiler to compile both Java and Groovy files
[INFO] 
[INFO] --- maven-resources-plugin:2.4:testResources (default-testResources) @ itest-common
---
[INFO] Using 'UTF-8' encoding to copy filtered resources.
[INFO] skip non existing resourceDirectory <https://builds.apache.org/job/Bigtop-trunk-iTest/org.apache.bigtop.itest$itest-common/ws/src/test/resources>
[INFO] Copying 3 resources
[INFO] 
[INFO] --- maven-compiler-plugin:3.1:testCompile (default-testCompile) @ itest-common ---
[INFO] Changes detected - recompiling the module!
[INFO] Using Groovy-Eclipse compiler to compile both Java and Groovy files
[INFO] 
[INFO] --- maven-surefire-plugin:2.7:test (default-test) @ itest-common ---
[INFO] Surefire report directory: <https://builds.apache.org/job/Bigtop-trunk-iTest/org.apache.bigtop.itest$itest-common/ws/target/surefire-reports>

-------------------------------------------------------
 T E S T S
-------------------------------------------------------
Running org.apache.bigtop.itest.TestContractGroovy
Tests run: 2, Failures: 0, Errors: 0, Skipped: 0, Time elapsed: 0.429 sec
Running org.apache.bigtop.itest.TestContractJava
Tests run: 2, Failures: 0, Errors: 0, Skipped: 0, Time elapsed: 0.002 sec
Running org.apache.bigtop.itest.JarContentTest
log4j:WARN No appenders could be found for logger (org.apache.bigtop.itest.JarContent).
log4j:WARN Please initialize the log4j system properly.
Tests run: 6, Failures: 0, Errors: 0, Skipped: 0, Time elapsed: 1.105 sec
Running org.apache.bigtop.itest.TestContractJavaProc
Tests run: 2, Failures: 0, Errors: 0, Skipped: 0, Time elapsed: 0.002 sec
Running org.apache.bigtop.itest.posix.UGITest
Tests run: 2, Failures: 0, Errors: 0, Skipped: 0, Time elapsed: 0.048 sec
Running org.apache.bigtop.itest.posix.AlternativeTest
Tests run: 1, Failures: 0, Errors: 0, Skipped: 0, Time elapsed: 1.861 sec
Running org.apache.bigtop.itest.posix.ServiceTest
Status []
Tests run: 2, Failures: 0, Errors: 0, Skipped: 1, Time elapsed: 0.154 sec
Running org.apache.bigtop.itest.shell.ShellTest
Tests run: 2, Failures: 0, Errors: 0, Skipped: 1, Time elapsed: 0.027 sec
Running org.apache.bigtop.itest.JUnitUtilsTest
Disclaimer: This test expected to show a failure in an embeded testcase
    [junit] Running org.apache.bigtop.itest.DummyTestPassTests run: 1, Failures: 0, Errors:
0, Time elapsed: 0.271 secRunning org.apache.bigtop.itest.DummyTestFailTests run: 1, Failures:
1, Errors: 0, Time elapsed: 0.141 sec
    [junit] TEST org.apache.bigtop.itest.DummyTestFail FAILED
    [junit] Tests FAILED
Disclaimer: This test expected to show an error in an embeded testcase
    [junit] Running org.apache.bigtop.itest.DummyTestError
    [junit] Tests run: 1, Failures: 0, Errors: 1, Time elapsed: 0.287 sec
    [junit] Test org.apache.bigtop.itest.DummyTestError FAILED
    [junit] Running org.apache.bigtop.itest.DummyTestPass
    [junit] Tests run: 1, Failures: 0, Errors: 0, Time elapsed: 0.273 sec
    [junit] Running org.apache.bigtop.itest.DummyTestPass
    [junit] Tests run: 1, Failures: 0, Errors: 0, Time elapsed: 0.275 sec
Tests run: 4, Failures: 0, Errors: 0, Skipped: 0, Time elapsed: 4.441 sec
Running org.apache.bigtop.itest.pmanager.PackageManagerTest
/etc/cron.monthly/.placeholder
/etc/cron.hourly/.placeholder
/etc/default/cron
/etc/cron.weekly/.placeholder
/etc/cron.d/.placeholder
/etc/cron.daily/.placeholder
/etc/pam.d/cron
/etc/init/cron.conf
/etc/crontab
/.
/etc
/etc/cron.monthly
/etc/cron.monthly/.placeholder
/etc/cron.hourly
/etc/cron.hourly/.placeholder
/etc/default
/etc/default/cron
/etc/cron.weekly
/etc/cron.weekly/.placeholder
/etc/cron.d
/etc/cron.d/.placeholder
/etc/cron.daily
/etc/cron.daily/.placeholder
/etc/pam.d
/etc/pam.d/cron
/etc/init
/etc/init/cron.conf
/etc/init.d
/etc/crontab
/usr
/usr/share
/usr/share/bug
/usr/share/bug/cron
/usr/share/bug/cron/script
/usr/share/bug/cron/control
/usr/share/man
/usr/share/man/man1
/usr/share/man/man1/crontab.1.gz
/usr/share/man/man5
/usr/share/man/man5/crontab.5.gz
/usr/share/man/man8
/usr/share/man/man8/cron.8.gz
/usr/share/doc
/usr/share/doc/cron
/usr/share/doc/cron/README
/usr/share/doc/cron/README.anacron
/usr/share/doc/cron/README.Debian
/usr/share/doc/cron/FEATURES
/usr/share/doc/cron/copyright
/usr/share/doc/cron/examples
/usr/share/doc/cron/examples/crontab2english.pl
/usr/share/doc/cron/examples/cron-stats.pl
/usr/share/doc/cron/examples/cron-tasks-review.sh
/usr/share/doc/cron/NEWS.Debian.gz
/usr/share/doc/cron/changelog.Debian.gz
/usr/share/doc/cron/THANKS
/usr/share/doc/cron/TODO.Debian
/usr/sbin
/usr/sbin/cron
/usr/bin
/usr/bin/crontab
/var
/var/spool
/var/spool/cron
/var/spool/cron/crontabs
/etc/init.d/cron
Tests run: 11, Failures: 0, Errors: 0, Skipped: 3, Time elapsed: 4.042 sec
Running org.apache.bigtop.itest.TestListUtilsTest
Tests run: 1, Failures: 0, Errors: 0, Skipped: 0, Time elapsed: 0.012 sec
Running org.apache.bigtop.itest.junit.OrderedParameterizedTest
Tests run: 3, Failures: 0, Errors: 0, Skipped: 0, Time elapsed: 0.03 sec
Running org.apache.bigtop.itest.junit.OrderedTest
Tests run: 3, Failures: 0, Errors: 0, Skipped: 0, Time elapsed: 0.008 sec

Results :

Tests run: 41, Failures: 0, Errors: 0, Skipped: 5

[JENKINS] Recording test results
log4j:WARN No appenders could be found for logger (org.apache.commons.beanutils.converters.BooleanConverter).
log4j:WARN Please initialize the log4j system properly.
[INFO] 
[INFO] --- maven-jar-plugin:2.2:jar (default-jar) @ itest-common ---
[INFO] Building jar: <https://builds.apache.org/job/Bigtop-trunk-iTest/org.apache.bigtop.itest$itest-common/ws/target/itest-common-0.9.0-SNAPSHOT.jar>
[INFO] 
[INFO] --- maven-jar-plugin:2.2:test-jar (default) @ itest-common ---
[INFO] Building jar: <https://builds.apache.org/job/Bigtop-trunk-iTest/org.apache.bigtop.itest$itest-common/ws/target/itest-common-0.9.0-SNAPSHOT-tests.jar>
[INFO] 
[INFO] --- maven-failsafe-plugin:2.17:verify (default) @ itest-common ---
[INFO] Failsafe report directory: <https://builds.apache.org/job/Bigtop-trunk-iTest/org.apache.bigtop.itest$itest-common/ws/target/failsafe-reports>
[WARNING] File encoding has not been set, using platform encoding ISO-8859-1, i.e. build is
platform dependent!
[JENKINS] Recording test results
[INFO] ------------------------------------------------------------------------
[INFO] BUILD FAILURE
[INFO] ------------------------------------------------------------------------
[INFO] Total time: 31.250s
[INFO] Finished at: Thu Jan 29 00:46:15 UTC 2015
[INFO] Final Memory: 15M/245M
[INFO] ------------------------------------------------------------------------
Waiting for Jenkins to finish collecting data
[ERROR] Failed to execute goal org.apache.maven.plugins:maven-failsafe-plugin:2.17:verify
(default) on project itest-common: <https://builds.apache.org/job/Bigtop-trunk-iTest/org.apache.bigtop.itest$itest-common/ws/target/failsafe-reports/failsafe-summary.xml>
(No such file or directory) -> [Help 1]
[ERROR] 
[ERROR] To see the full stack trace of the errors, re-run Maven with the -e switch.
[ERROR] Re-run Maven using the -X switch to enable full debug logging.
[ERROR] 
[ERROR] For more information about the errors and possible solutions, please read the following
articles:
[ERROR] [Help 1] http://cwiki.apache.org/confluence/display/MAVEN/MojoExecutionException

Mime
View raw message