bigtop-ci mailing list archives

Site index · List index
Message view « Date » · « Thread »
Top « Date » · « Thread »
From Apache Jenkins Server <jenk...@builds.apache.org>
Subject Build failed in Jenkins: Bigtop-trunk-testartifacts #1590
Date Sun, 18 Jan 2015 01:48:21 GMT
See <https://builds.apache.org/job/Bigtop-trunk-testartifacts/1590/changes>

Changes:

[jayunit100] BIGTOP-1605. Tachyon RPM does not depend on bigtop utils.

------------------------------------------
[...truncated 565 lines...]
[INFO] 
[INFO] --- maven-remote-resources-plugin:1.1:process (default) @ mahout-smoke ---
[INFO] 
[INFO] --- maven-resources-plugin:2.4.3:resources (default-resources) @ mahout-smoke ---
[INFO] Using 'UTF-8' encoding to copy filtered resources.
[INFO] skip non existing resourceDirectory <https://builds.apache.org/job/Bigtop-trunk-testartifacts/ws/bigtop-tests/test-artifacts/mahout/src/main/resources>
[INFO] Copying 3 resources
[INFO] 
[INFO] --- maven-compiler-plugin:3.1:compile (default-compile) @ mahout-smoke ---
[INFO] Changes detected - recompiling the module!
[INFO] Using Groovy-Eclipse compiler to compile both Java and Groovy files
org.codehaus.groovy.control.messages.SyntaxErrorMessage@10f7532
org.codehaus.groovy.control.messages.SyntaxErrorMessage@1d760a1
org.codehaus.groovy.control.messages.SyntaxErrorMessage@109298b
org.codehaus.groovy.control.messages.SyntaxErrorMessage@86a2c1
<https://builds.apache.org/job/Bigtop-trunk-testartifacts/ws/bigtop-tests/test-artifacts/mahout/src/main/groovy/org/apache/bigtop/itest/mahout/smoke/TestMahoutExamples.groovy>:
74 Groovy:unexpected token: f_name @ line 74, column 13.
<https://builds.apache.org/job/Bigtop-trunk-testartifacts/ws/bigtop-tests/test-artifacts/mahout/src/main/groovy/org/apache/bigtop/itest/mahout/smoke/TestMahoutExamples.groovy>:
75 Groovy:unexpected token: sh @ line 75, column 13.
<https://builds.apache.org/job/Bigtop-trunk-testartifacts/ws/bigtop-tests/test-artifacts/mahout/src/main/groovy/org/apache/bigtop/itest/mahout/smoke/TestMahoutExamples.groovy>:
80 Groovy:unexpected token: assertTrue @ line 80, column 13.
<https://builds.apache.org/job/Bigtop-trunk-testartifacts/ws/bigtop-tests/test-artifacts/mahout/src/main/groovy/org/apache/bigtop/itest/mahout/smoke/TestMahoutExamples.groovy>:
83 Groovy:unexpected token: } @ line 83, column 5.
[INFO] -------------------------------------------------------------
[ERROR] COMPILATION ERROR : 
[INFO] -------------------------------------------------------------
[ERROR] <https://builds.apache.org/job/Bigtop-trunk-testartifacts/ws/bigtop-tests/test-artifacts/mahout/src/main/groovy/org/apache/bigtop/itest/mahout/smoke/TestMahoutExamples.groovy>:[74,1]
1. ERROR in <https://builds.apache.org/job/Bigtop-trunk-testartifacts/ws/bigtop-tests/test-artifacts/mahout/src/main/groovy/org/apache/bigtop/itest/mahout/smoke/TestMahoutExamples.groovy>
(at line 74)
	f_name,loc -&gt;
	^
Groovy:unexpected token: f_name @ line 74, column 13.

[ERROR] <https://builds.apache.org/job/Bigtop-trunk-testartifacts/ws/bigtop-tests/test-artifacts/mahout/src/main/groovy/org/apache/bigtop/itest/mahout/smoke/TestMahoutExamples.groovy>:[75,1]
2. ERROR in <https://builds.apache.org/job/Bigtop-trunk-testartifacts/ws/bigtop-tests/test-artifacts/mahout/src/main/groovy/org/apache/bigtop/itest/mahout/smoke/TestMahoutExamples.groovy>
(at line 75)
	sh.exec("if [ ! -f ${download_dir}/${f_name} ]; then " +
	^
Groovy:unexpected token: sh @ line 75, column 13.

[ERROR] <https://builds.apache.org/job/Bigtop-trunk-testartifacts/ws/bigtop-tests/test-artifacts/mahout/src/main/groovy/org/apache/bigtop/itest/mahout/smoke/TestMahoutExamples.groovy>:[80,1]
3. ERROR in <https://builds.apache.org/job/Bigtop-trunk-testartifacts/ws/bigtop-tests/test-artifacts/mahout/src/main/groovy/org/apache/bigtop/itest/mahout/smoke/TestMahoutExamples.groovy>
(at line 80)
	assertTrue("file "+ f_name + " at  "+loc + " len=" + file.length() + " is &gt; 5k bytes",
file.length() &gt; 5000 );
	^
Groovy:unexpected token: assertTrue @ line 80, column 13.

[ERROR] <https://builds.apache.org/job/Bigtop-trunk-testartifacts/ws/bigtop-tests/test-artifacts/mahout/src/main/groovy/org/apache/bigtop/itest/mahout/smoke/TestMahoutExamples.groovy>:[83,1]
4. ERROR in <https://builds.apache.org/job/Bigtop-trunk-testartifacts/ws/bigtop-tests/test-artifacts/mahout/src/main/groovy/org/apache/bigtop/itest/mahout/smoke/TestMahoutExamples.groovy>
(at line 83)
	}
	^
Groovy:unexpected token: } @ line 83, column 5.

[ERROR] Found 4 errors and 0 warnings.
[INFO] 5 errors 
[INFO] -------------------------------------------------------------
[INFO] ------------------------------------------------------------------------
[INFO] Reactor Summary:
[INFO] 
[INFO] bigtop-smokes ..................................... SUCCESS [8.129s]
[INFO] hadoopsmoke ....................................... SUCCESS [20.346s]
[INFO] packagesmoke ...................................... SUCCESS [12.244s]
[INFO] httpfssmokes ...................................... SUCCESS [6.631s]
[INFO] ooziesmoke ........................................ SUCCESS [38.086s]
[INFO] hbasesmoke ........................................ SUCCESS [10.815s]
[INFO] flumesmoke ........................................ SUCCESS [5.469s]
[INFO] sqoopsmokes ....................................... SUCCESS [13.323s]
[INFO] mahoutsmoke ....................................... FAILURE [0.559s]
[INFO] giraphsmoke ....................................... SKIPPED
[INFO] huesmoke .......................................... SKIPPED
[INFO] solrsmoke ......................................... SKIPPED
[INFO] crunchsmoke ....................................... SKIPPED
[INFO] datafusmoke ....................................... SKIPPED
[INFO] io-longevity ...................................... SKIPPED
[INFO] hcatalogsmoke ..................................... SKIPPED
[INFO] sparksmoke ........................................ SKIPPED
[INFO] phoenixsmoke ...................................... SKIPPED
[INFO] fatjar ............................................ SKIPPED
[INFO] ------------------------------------------------------------------------
[INFO] BUILD FAILURE
[INFO] ------------------------------------------------------------------------
[INFO] Total time: 2:05.968s
[INFO] Finished at: Sun Jan 18 01:48:07 UTC 2015
[INFO] Final Memory: 32M/360M
[INFO] ------------------------------------------------------------------------
Waiting for Jenkins to finish collecting data
[ERROR] Failed to execute goal org.apache.maven.plugins:maven-compiler-plugin:3.1:compile
(default-compile) on project mahout-smoke: Compilation failure: Compilation failure:
[ERROR] <https://builds.apache.org/job/Bigtop-trunk-testartifacts/ws/bigtop-tests/test-artifacts/mahout/src/main/groovy/org/apache/bigtop/itest/mahout/smoke/TestMahoutExamples.groovy>:[74,1]
1. ERROR in <https://builds.apache.org/job/Bigtop-trunk-testartifacts/ws/bigtop-tests/test-artifacts/mahout/src/main/groovy/org/apache/bigtop/itest/mahout/smoke/TestMahoutExamples.groovy>
(at line 74)
[ERROR] f_name,loc -&gt;
[ERROR] ^
[ERROR] Groovy:unexpected token: f_name @ line 74, column 13.
[ERROR] 
[ERROR] <https://builds.apache.org/job/Bigtop-trunk-testartifacts/ws/bigtop-tests/test-artifacts/mahout/src/main/groovy/org/apache/bigtop/itest/mahout/smoke/TestMahoutExamples.groovy>:[75,1]
2. ERROR in <https://builds.apache.org/job/Bigtop-trunk-testartifacts/ws/bigtop-tests/test-artifacts/mahout/src/main/groovy/org/apache/bigtop/itest/mahout/smoke/TestMahoutExamples.groovy>
(at line 75)
[ERROR] sh.exec("if [ ! -f ${download_dir}/${f_name} ]; then " +
[ERROR] ^
[ERROR] Groovy:unexpected token: sh @ line 75, column 13.
[ERROR] 
[ERROR] <https://builds.apache.org/job/Bigtop-trunk-testartifacts/ws/bigtop-tests/test-artifacts/mahout/src/main/groovy/org/apache/bigtop/itest/mahout/smoke/TestMahoutExamples.groovy>:[80,1]
3. ERROR in <https://builds.apache.org/job/Bigtop-trunk-testartifacts/ws/bigtop-tests/test-artifacts/mahout/src/main/groovy/org/apache/bigtop/itest/mahout/smoke/TestMahoutExamples.groovy>
(at line 80)
[ERROR] assertTrue("file "+ f_name + " at  "+loc + " len=" + file.length() + " is &gt;
5k bytes", file.length() &gt; 5000 );
[ERROR] ^
[ERROR] Groovy:unexpected token: assertTrue @ line 80, column 13.
[ERROR] 
[ERROR] <https://builds.apache.org/job/Bigtop-trunk-testartifacts/ws/bigtop-tests/test-artifacts/mahout/src/main/groovy/org/apache/bigtop/itest/mahout/smoke/TestMahoutExamples.groovy>:[83,1]
4. ERROR in <https://builds.apache.org/job/Bigtop-trunk-testartifacts/ws/bigtop-tests/test-artifacts/mahout/src/main/groovy/org/apache/bigtop/itest/mahout/smoke/TestMahoutExamples.groovy>
(at line 83)
[ERROR] }
[ERROR] ^
[ERROR] Groovy:unexpected token: } @ line 83, column 5.
[ERROR] 
[ERROR] Found 4 errors and 0 warnings.
[ERROR] -> [Help 1]
[ERROR] 
[ERROR] To see the full stack trace of the errors, re-run Maven with the -e switch.
[ERROR] Re-run Maven using the -X switch to enable full debug logging.
[ERROR] 
[ERROR] For more information about the errors and possible solutions, please read the following
articles:
[ERROR] [Help 1] http://cwiki.apache.org/confluence/display/MAVEN/MojoFailureException
[ERROR] 
[ERROR] After correcting the problems, you can resume the build with the command
[ERROR]   mvn <goals> -rf :mahout-smoke
[JENKINS] Archiving <https://builds.apache.org/job/Bigtop-trunk-testartifacts/ws/bigtop-tests/test-artifacts/pom.xml>
to org.apache.bigtop.itest/bigtop-smokes/0.9.0-SNAPSHOT/bigtop-smokes-0.9.0-SNAPSHOT.pom
Sending artifact delta relative to Bigtop-trunk-testartifacts » bigtop-smokes #1589
Archived 1 artifacts
Archive block size is 32768
Received 0 blocks and 4894 bytes
Compression is 0.0%
Took 0.13 sec
[JENKINS] Archiving <https://builds.apache.org/job/Bigtop-trunk-testartifacts/ws/bigtop-tests/test-artifacts/sqoop/pom.xml>
to org.apache.bigtop.itest/sqoop-smoke/0.9.0-SNAPSHOT/sqoop-smoke-0.9.0-SNAPSHOT.pom
[JENKINS] Archiving <https://builds.apache.org/job/Bigtop-trunk-testartifacts/ws/bigtop-tests/test-artifacts/sqoop/target/sqoop-smoke-0.9.0-SNAPSHOT.jar>
to org.apache.bigtop.itest/sqoop-smoke/0.9.0-20150118.014755-67/sqoop-smoke-0.9.0-20150118.014755-67.jar
Sending artifact delta relative to Bigtop-trunk-testartifacts » sqoopsmokes #1589
Archived 2 artifacts
Archive block size is 32768
Received 0 blocks and 50623 bytes
Compression is 0.0%
Took 0.15 sec
[JENKINS] Archiving <https://builds.apache.org/job/Bigtop-trunk-testartifacts/ws/bigtop-tests/test-artifacts/hue/pom.xml>
to org.apache.bigtop.itest/hue-smoke/0.9.0-SNAPSHOT/hue-smoke-0.9.0-SNAPSHOT.pom
Sending artifact delta relative to Bigtop-trunk-testartifacts » huesmoke #1587
Archived 1 artifacts
Archive block size is 32768
Received 0 blocks and 1510 bytes
Compression is 0.0%
Took 95 ms
[JENKINS] Archiving <https://builds.apache.org/job/Bigtop-trunk-testartifacts/ws/bigtop-tests/test-artifacts/crunch/pom.xml>
to org.apache.bigtop.itest/crunch-smoke/0.9.0-SNAPSHOT/crunch-smoke-0.9.0-SNAPSHOT.pom
Sending artifact delta relative to Bigtop-trunk-testartifacts » crunchsmoke #1587
Archived 1 artifacts
Archive block size is 32768
Received 0 blocks and 1521 bytes
Compression is 0.0%
Took 0.18 sec
[JENKINS] Archiving <https://builds.apache.org/job/Bigtop-trunk-testartifacts/ws/bigtop-tests/test-artifacts/package/pom.xml>
to org.apache.bigtop.itest/package-smoke/0.9.0-SNAPSHOT/package-smoke-0.9.0-SNAPSHOT.pom
[JENKINS] Archiving <https://builds.apache.org/job/Bigtop-trunk-testartifacts/ws/bigtop-tests/test-artifacts/package/target/package-smoke-0.9.0-SNAPSHOT.jar>
to org.apache.bigtop.itest/package-smoke/0.9.0-20150118.014643-67/package-smoke-0.9.0-20150118.014643-67.jar
Sending artifact delta relative to Bigtop-trunk-testartifacts » packagesmoke #1589
Archived 2 artifacts
Archive block size is 32768
Received 1 blocks and 778254 bytes
Compression is 4.0%
Took 0.62 sec
[JENKINS] Archiving <https://builds.apache.org/job/Bigtop-trunk-testartifacts/ws/bigtop-tests/test-artifacts/flume/pom.xml>
to org.apache.bigtop.itest/flume-smoke/0.9.0-SNAPSHOT/flume-smoke-0.9.0-SNAPSHOT.pom
[JENKINS] Archiving <https://builds.apache.org/job/Bigtop-trunk-testartifacts/ws/bigtop-tests/test-artifacts/flume/target/flume-smoke-0.9.0-SNAPSHOT.jar>
to org.apache.bigtop.itest/flume-smoke/0.9.0-20150118.014749-67/flume-smoke-0.9.0-20150118.014749-67.jar
Sending artifact delta relative to Bigtop-trunk-testartifacts » flumesmoke #1589
Archived 2 artifacts
Archive block size is 32768
Received 0 blocks and 42423 bytes
Compression is 0.0%
Took 0.11 sec
[JENKINS] Archiving <https://builds.apache.org/job/Bigtop-trunk-testartifacts/ws/bigtop-tests/test-artifacts/httpfs/pom.xml>
to org.apache.bigtop.itest/httpfs-smoke/0.9.0-SNAPSHOT/httpfs-smoke-0.9.0-SNAPSHOT.pom
[JENKINS] Archiving <https://builds.apache.org/job/Bigtop-trunk-testartifacts/ws/bigtop-tests/test-artifacts/httpfs/target/httpfs-smoke-0.9.0-SNAPSHOT.jar>
to org.apache.bigtop.itest/httpfs-smoke/0.9.0-20150118.014652-67/httpfs-smoke-0.9.0-20150118.014652-67.jar
Sending artifact delta relative to Bigtop-trunk-testartifacts » httpfssmokes #1589
Archived 2 artifacts
Archive block size is 32768
Received 0 blocks and 17689 bytes
Compression is 0.0%
Took 0.1 sec
[JENKINS] Archiving <https://builds.apache.org/job/Bigtop-trunk-testartifacts/ws/bigtop-tests/test-artifacts/spark/pom.xml>
to org.apache.bigtop.itest/spark-smoke/0.9.0-SNAPSHOT/spark-smoke-0.9.0-SNAPSHOT.pom
Sending artifact delta relative to Bigtop-trunk-testartifacts » sparksmoke #1587
Archived 1 artifacts
Archive block size is 32768
Received 0 blocks and 2266 bytes
Compression is 0.0%
Took 88 ms
[JENKINS] Archiving <https://builds.apache.org/job/Bigtop-trunk-testartifacts/ws/bigtop-tests/test-artifacts/hadoop/pom.xml>
to org.apache.bigtop.itest/hadoop-smoke/0.9.0-SNAPSHOT/hadoop-smoke-0.9.0-SNAPSHOT.pom
[JENKINS] Archiving <https://builds.apache.org/job/Bigtop-trunk-testartifacts/ws/bigtop-tests/test-artifacts/hadoop/target/hadoop-smoke-0.9.0-SNAPSHOT.jar>
to org.apache.bigtop.itest/hadoop-smoke/0.9.0-20150118.014631-67/hadoop-smoke-0.9.0-20150118.014631-67.jar
Sending artifact delta relative to Bigtop-trunk-testartifacts » hadoopsmoke #1589
Archived 2 artifacts
Archive block size is 32768
Received 2 blocks and 265983 bytes
Compression is 19.8%
Took 0.19 sec
[JENKINS] Archiving <https://builds.apache.org/job/Bigtop-trunk-testartifacts/ws/bigtop-tests/test-artifacts/oozie/pom.xml>
to org.apache.bigtop.itest/oozie-smoke/0.9.0-SNAPSHOT/oozie-smoke-0.9.0-SNAPSHOT.pom
[JENKINS] Archiving <https://builds.apache.org/job/Bigtop-trunk-testartifacts/ws/bigtop-tests/test-artifacts/oozie/target/oozie-smoke-0.9.0-SNAPSHOT.jar>
to org.apache.bigtop.itest/oozie-smoke/0.9.0-20150118.014659-67/oozie-smoke-0.9.0-20150118.014659-67.jar
Sending artifact delta relative to Bigtop-trunk-testartifacts » ooziesmoke #1589
Archived 2 artifacts
Archive block size is 32768
Received 0 blocks and 16597 bytes
Compression is 0.0%
Took 76 ms
[JENKINS] Archiving <https://builds.apache.org/job/Bigtop-trunk-testartifacts/ws/bigtop-tests/test-artifacts/giraph/pom.xml>
to org.apache.bigtop.itest/giraph-smoke/0.9.0-SNAPSHOT/giraph-smoke-0.9.0-SNAPSHOT.pom
Sending artifact delta relative to Bigtop-trunk-testartifacts » giraphsmoke #1587
Archived 1 artifacts
Archive block size is 32768
Received 0 blocks and 1522 bytes
Compression is 0.0%
Took 77 ms
[JENKINS] Archiving <https://builds.apache.org/job/Bigtop-trunk-testartifacts/ws/bigtop-tests/test-artifacts/hcatalog/pom.xml>
to org.apache.bigtop.itest/hcatalog-smoke/0.9.0-SNAPSHOT/hcatalog-smoke-0.9.0-SNAPSHOT.pom
Sending artifact delta relative to Bigtop-trunk-testartifacts » hcatalogsmoke #1587
Archived 1 artifacts
Archive block size is 32768
Received 0 blocks and 1529 bytes
Compression is 0.0%
Took 0.15 sec
[JENKINS] Archiving <https://builds.apache.org/job/Bigtop-trunk-testartifacts/ws/bigtop-tests/test-artifacts/datafu/pom.xml>
to org.apache.bigtop.itest/datafu-smoke/0.9.0-SNAPSHOT/datafu-smoke-0.9.0-SNAPSHOT.pom
Sending artifact delta relative to Bigtop-trunk-testartifacts » datafusmoke #1587
Archived 1 artifacts
Archive block size is 32768
Received 0 blocks and 2405 bytes
Compression is 0.0%
Took 80 ms
[JENKINS] Archiving <https://builds.apache.org/job/Bigtop-trunk-testartifacts/ws/bigtop-tests/test-artifacts/longevity/pom.xml>
to org.apache.bigtop.itest/io-longevity/0.9.0-SNAPSHOT/io-longevity-0.9.0-SNAPSHOT.pom
Sending artifact delta relative to Bigtop-trunk-testartifacts » io-longevity #1587
Archived 1 artifacts
Archive block size is 32768
Received 0 blocks and 1699 bytes
Compression is 0.0%
Took 73 ms
[JENKINS] Archiving <https://builds.apache.org/job/Bigtop-trunk-testartifacts/ws/bigtop-tests/test-artifacts/mahout/pom.xml>
to org.apache.bigtop.itest/mahout-smoke/0.9.0-SNAPSHOT/mahout-smoke-0.9.0-SNAPSHOT.pom
Sending artifact delta relative to Bigtop-trunk-testartifacts » mahoutsmoke #1587
Archived 1 artifacts
Archive block size is 32768
Received 0 blocks and 1522 bytes
Compression is 0.0%
Took 78 ms
[JENKINS] Archiving <https://builds.apache.org/job/Bigtop-trunk-testartifacts/ws/bigtop-tests/test-artifacts/hbase/pom.xml>
to org.apache.bigtop.itest/hbase-smoke/0.9.0-SNAPSHOT/hbase-smoke-0.9.0-SNAPSHOT.pom
[JENKINS] Archiving <https://builds.apache.org/job/Bigtop-trunk-testartifacts/ws/bigtop-tests/test-artifacts/hbase/target/hbase-smoke-0.9.0-SNAPSHOT.jar>
to org.apache.bigtop.itest/hbase-smoke/0.9.0-20150118.014742-67/hbase-smoke-0.9.0-20150118.014742-67.jar
Sending artifact delta relative to Bigtop-trunk-testartifacts » hbasesmoke #1589
Archived 2 artifacts
Archive block size is 32768
Received 0 blocks and 184780 bytes
Compression is 0.0%
Took 0.14 sec
[JENKINS] Archiving <https://builds.apache.org/job/Bigtop-trunk-testartifacts/ws/bigtop-tests/test-artifacts/solr/pom.xml>
to org.apache.bigtop.itest/solr-smoke/0.9.0-SNAPSHOT/solr-smoke-0.9.0-SNAPSHOT.pom
Sending artifact delta relative to Bigtop-trunk-testartifacts » solrsmoke #1587
Archived 1 artifacts
Archive block size is 32768
Received 0 blocks and 1784 bytes
Compression is 0.0%
Took 80 ms
[JENKINS] Archiving <https://builds.apache.org/job/Bigtop-trunk-testartifacts/ws/bigtop-tests/test-artifacts/phoenix/pom.xml>
to org.apache.bigtop.itest/phoenix-smoke/0.9.0-SNAPSHOT/phoenix-smoke-0.9.0-SNAPSHOT.pom
Sending artifact delta relative to Bigtop-trunk-testartifacts » phoenixsmoke #1587
Archived 1 artifacts
Archive block size is 32768
Received 0 blocks and 1526 bytes
Compression is 0.0%
Took 72 ms
[JENKINS] Archiving <https://builds.apache.org/job/Bigtop-trunk-testartifacts/ws/bigtop-tests/test-artifacts/fatjar/pom.xml>
to org.apache.bigtop.itest/fat-smoke/0.9.0-SNAPSHOT/fat-smoke-0.9.0-SNAPSHOT.pom
Sending artifact delta relative to Bigtop-trunk-testartifacts » fatjar #1587
Archived 1 artifacts
Archive block size is 32768
Received 0 blocks and 5446 bytes
Compression is 0.0%
Took 2 sec
Sending e-mails to: ci@bigtop.apache.org
channel stopped

Mime
View raw message