bigtop-ci mailing list archives

Site index · List index
Message view « Date » · « Thread »
Top « Date » · « Thread »
From Apache Jenkins Server <jenk...@builds.apache.org>
Subject Build failed in Jenkins: Bigtop-trunk-testartifacts #1517
Date Thu, 09 Oct 2014 02:32:05 GMT
See <https://builds.apache.org/job/Bigtop-trunk-testartifacts/1517/changes>

Changes:

[jayunit100] BIGTOP 1388. Use cluster failure tests during other tests ith command line parameterization.

------------------------------------------
[...truncated 143 lines...]
Downloaded: http://repo.maven.apache.org/maven2/org/apache/hadoop/hadoop-auth/2.4.1/hadoop-auth-2.4.1.jar
(50 KB at 281.9 KB/sec)
Downloaded: http://repo.maven.apache.org/maven2/org/apache/hadoop/hadoop-common/2.4.1/hadoop-common-2.4.1-tests.jar
(1476 KB at 1898.8 KB/sec)
Downloaded: http://repo.maven.apache.org/maven2/org/apache/hadoop/hadoop-common/2.4.1/hadoop-common-2.4.1.jar
(2841 KB at 3209.7 KB/sec)
Downloaded: http://repo.maven.apache.org/maven2/org/apache/hadoop/hadoop-hdfs/2.4.1/hadoop-hdfs-2.4.1.jar
(6670 KB at 5306.0 KB/sec)
[INFO] 
[INFO] --- maven-clean-plugin:2.4.1:clean (default-clean) @ hadoop-smoke ---
[INFO] Deleting <https://builds.apache.org/job/Bigtop-trunk-testartifacts/ws/bigtop-tests/test-artifacts/hadoop/target>
[INFO] 
[INFO] --- groovy-eclipse-compiler:2.8.0-01:add-groovy-build-paths (default-add-groovy-build-paths)
@ hadoop-smoke ---
[INFO] Adding /src/main/groovy to the list of source folders
[INFO] Adding /src/test/groovy to the list of test source folders
[INFO] 
[INFO] --- maven-remote-resources-plugin:1.1:process (default) @ hadoop-smoke ---
[INFO] 
[INFO] --- maven-resources-plugin:2.4.3:resources (default-resources) @ hadoop-smoke ---
[INFO] Using 'UTF-8' encoding to copy filtered resources.
[INFO] Copying 16 resources
[INFO] Copying 3 resources
[INFO] 
[INFO] --- maven-compiler-plugin:3.1:compile (default-compile) @ hadoop-smoke ---
[INFO] Changes detected - recompiling the module!
[INFO] Using Groovy-Eclipse compiler to compile both Java and Groovy files
org.codehaus.groovy.control.messages.SyntaxErrorMessage@1933646
org.codehaus.groovy.control.messages.SyntaxErrorMessage@b37db4
org.codehaus.groovy.control.messages.SyntaxErrorMessage@1c010
/x1/jenkins/jenkins-slave/workspace/Bigtop-trunk-testartifacts/bigtop-tests/test-artifacts/hadoop/src/main/groovy/org/apache/bigtop/itest/hadoop/mapreduce/TestHadoopExamples.groovy:
21 Groovy:unable to resolve class org.apache.bigtop.itest.failures.FailureVars
/x1/jenkins/jenkins-slave/workspace/Bigtop-trunk-testartifacts/bigtop-tests/test-artifacts/hadoop/src/main/groovy/org/apache/bigtop/itest/hadoop/mapreduce/TestHadoopExamples.groovy:
160 Groovy:unable to resolve class FailureExecutor 
/x1/jenkins/jenkins-slave/workspace/Bigtop-trunk-testartifacts/bigtop-tests/test-artifacts/hadoop/src/main/groovy/org/apache/bigtop/itest/hadoop/mapreduce/TestHadoopExamples.groovy:
160 Groovy:unable to resolve class FailureExecutor 
[INFO] -------------------------------------------------------------
[ERROR] COMPILATION ERROR : 
[INFO] -------------------------------------------------------------
[ERROR] /x1/jenkins/jenkins-slave/workspace/Bigtop-trunk-testartifacts/bigtop-tests/test-artifacts/hadoop/src/main/groovy/org/apache/bigtop/itest/hadoop/mapreduce/TestHadoopExamples.groovy:[21,41]
1. ERROR in /x1/jenkins/jenkins-slave/workspace/Bigtop-trunk-testartifacts/bigtop-tests/test-artifacts/hadoop/src/main/groovy/org/apache/bigtop/itest/hadoop/mapreduce/TestHadoopExamples.groovy
(at line 21)
	import org.apache.bigtop.itest.failures.FailureVars
	                                        ^^^^^^^^^^^
Groovy:unable to resolve class org.apache.bigtop.itest.failures.FailureVars

[ERROR] /x1/jenkins/jenkins-slave/workspace/Bigtop-trunk-testartifacts/bigtop-tests/test-artifacts/hadoop/src/main/groovy/org/apache/bigtop/itest/hadoop/mapreduce/TestHadoopExamples.groovy:[160,1]
2. ERROR in /x1/jenkins/jenkins-slave/workspace/Bigtop-trunk-testartifacts/bigtop-tests/test-artifacts/hadoop/src/main/groovy/org/apache/bigtop/itest/hadoop/mapreduce/TestHadoopExamples.groovy
(at line 160)
	FailureExecutor failureExecutor = new FailureExecutor();
	^^^^^^^^^^^^^^^
Groovy:unable to resolve class FailureExecutor 

[ERROR] /x1/jenkins/jenkins-slave/workspace/Bigtop-trunk-testartifacts/bigtop-tests/test-artifacts/hadoop/src/main/groovy/org/apache/bigtop/itest/hadoop/mapreduce/TestHadoopExamples.groovy:[160,39]
3. ERROR in /x1/jenkins/jenkins-slave/workspace/Bigtop-trunk-testartifacts/bigtop-tests/test-artifacts/hadoop/src/main/groovy/org/apache/bigtop/itest/hadoop/mapreduce/TestHadoopExamples.groovy
(at line 160)
	FailureExecutor failureExecutor = new FailureExecutor();
	                                      ^^^^^^^^^^^^^^^
Groovy:unable to resolve class FailureExecutor 

[ERROR] Found 3 errors and 0 warnings.
[INFO] 4 errors 
[INFO] -------------------------------------------------------------
[INFO] ------------------------------------------------------------------------
[INFO] Reactor Summary:
[INFO] 
[INFO] bigtop-smokes ..................................... SUCCESS [12.071s]
[INFO] hadoopsmoke ....................................... FAILURE [8.685s]
[INFO] packagesmoke ...................................... SKIPPED
[INFO] httpfssmokes ...................................... SKIPPED
[INFO] ooziesmoke ........................................ SKIPPED
[INFO] hivesmoke ......................................... SKIPPED
[INFO] hbasesmoke ........................................ SKIPPED
[INFO] flumesmoke ........................................ SKIPPED
[INFO] sqoopsmokes ....................................... SKIPPED
[INFO] mahoutsmoke ....................................... SKIPPED
[INFO] giraphsmoke ....................................... SKIPPED
[INFO] huesmoke .......................................... SKIPPED
[INFO] solrsmoke ......................................... SKIPPED
[INFO] crunchsmoke ....................................... SKIPPED
[INFO] datafusmoke ....................................... SKIPPED
[INFO] io-longevity ...................................... SKIPPED
[INFO] hcatalogsmoke ..................................... SKIPPED
[INFO] sparksmoke ........................................ SKIPPED
[INFO] phoenixsmoke ...................................... SKIPPED
[INFO] fatjar ............................................ SKIPPED
[INFO] ------------------------------------------------------------------------
[INFO] BUILD FAILURE
[INFO] ------------------------------------------------------------------------
[INFO] Total time: 25.748s
[INFO] Finished at: Thu Oct 09 02:31:37 UTC 2014
[INFO] Final Memory: 19M/113M
[INFO] ------------------------------------------------------------------------
Waiting for Jenkins to finish collecting data
[ERROR] Failed to execute goal org.apache.maven.plugins:maven-compiler-plugin:3.1:compile
(default-compile) on project hadoop-smoke: Compilation failure: Compilation failure:
[ERROR] /x1/jenkins/jenkins-slave/workspace/Bigtop-trunk-testartifacts/bigtop-tests/test-artifacts/hadoop/src/main/groovy/org/apache/bigtop/itest/hadoop/mapreduce/TestHadoopExamples.groovy:[21,41]
1. ERROR in /x1/jenkins/jenkins-slave/workspace/Bigtop-trunk-testartifacts/bigtop-tests/test-artifacts/hadoop/src/main/groovy/org/apache/bigtop/itest/hadoop/mapreduce/TestHadoopExamples.groovy
(at line 21)
[ERROR] import org.apache.bigtop.itest.failures.FailureVars
[ERROR] ^^^^^^^^^^^
[ERROR] Groovy:unable to resolve class org.apache.bigtop.itest.failures.FailureVars
[ERROR] 
[ERROR] /x1/jenkins/jenkins-slave/workspace/Bigtop-trunk-testartifacts/bigtop-tests/test-artifacts/hadoop/src/main/groovy/org/apache/bigtop/itest/hadoop/mapreduce/TestHadoopExamples.groovy:[160,1]
2. ERROR in /x1/jenkins/jenkins-slave/workspace/Bigtop-trunk-testartifacts/bigtop-tests/test-artifacts/hadoop/src/main/groovy/org/apache/bigtop/itest/hadoop/mapreduce/TestHadoopExamples.groovy
(at line 160)
[ERROR] FailureExecutor failureExecutor = new FailureExecutor();
[ERROR] ^^^^^^^^^^^^^^^
[ERROR] Groovy:unable to resolve class FailureExecutor
[ERROR] 
[ERROR] /x1/jenkins/jenkins-slave/workspace/Bigtop-trunk-testartifacts/bigtop-tests/test-artifacts/hadoop/src/main/groovy/org/apache/bigtop/itest/hadoop/mapreduce/TestHadoopExamples.groovy:[160,39]
3. ERROR in /x1/jenkins/jenkins-slave/workspace/Bigtop-trunk-testartifacts/bigtop-tests/test-artifacts/hadoop/src/main/groovy/org/apache/bigtop/itest/hadoop/mapreduce/TestHadoopExamples.groovy
(at line 160)
[ERROR] FailureExecutor failureExecutor = new FailureExecutor();
[ERROR] ^^^^^^^^^^^^^^^
[ERROR] Groovy:unable to resolve class FailureExecutor
[ERROR] 
[ERROR] Found 3 errors and 0 warnings.
[ERROR] -> [Help 1]
[ERROR] 
[ERROR] To see the full stack trace of the errors, re-run Maven with the -e switch.
[ERROR] Re-run Maven using the -X switch to enable full debug logging.
[ERROR] 
[ERROR] For more information about the errors and possible solutions, please read the following
articles:
[ERROR] [Help 1] http://cwiki.apache.org/confluence/display/MAVEN/MojoFailureException
[ERROR] 
[ERROR] After correcting the problems, you can resume the build with the command
[ERROR]   mvn <goals> -rf :hadoop-smoke
[JENKINS] Archiving <https://builds.apache.org/job/Bigtop-trunk-testartifacts/ws/bigtop-tests/test-artifacts/pom.xml>
to org.apache.bigtop.itest/bigtop-smokes/0.9.0-SNAPSHOT/bigtop-smokes-0.9.0-SNAPSHOT.pom
Sending artifact delta relative to Bigtop-trunk-testartifacts ? bigtop-smokes #1516
Archived 1 artifacts
Archive block size is 32768
Received 0 blocks and 4920 bytes
Compression is 0.0%
Took 49 ms
[JENKINS] Archiving <https://builds.apache.org/job/Bigtop-trunk-testartifacts/ws/bigtop-tests/test-artifacts/sqoop/pom.xml>
to org.apache.bigtop.itest/sqoop-smoke/0.9.0-SNAPSHOT/sqoop-smoke-0.9.0-SNAPSHOT.pom
Sending artifact delta relative to Bigtop-trunk-testartifacts ? sqoopsmokes #1516
Archived 1 artifacts
Archive block size is 32768
Received 0 blocks and 1837 bytes
Compression is 0.0%
Took 45 ms
[JENKINS] Archiving <https://builds.apache.org/job/Bigtop-trunk-testartifacts/ws/bigtop-tests/test-artifacts/hue/pom.xml>
to org.apache.bigtop.itest/hue-smoke/0.9.0-SNAPSHOT/hue-smoke-0.9.0-SNAPSHOT.pom
Sending artifact delta relative to Bigtop-trunk-testartifacts ? huesmoke #1516
Archived 1 artifacts
Archive block size is 32768
Received 0 blocks and 1510 bytes
Compression is 0.0%
Took 38 ms
[JENKINS] Archiving <https://builds.apache.org/job/Bigtop-trunk-testartifacts/ws/bigtop-tests/test-artifacts/crunch/pom.xml>
to org.apache.bigtop.itest/crunch-smoke/0.9.0-SNAPSHOT/crunch-smoke-0.9.0-SNAPSHOT.pom
Sending artifact delta relative to Bigtop-trunk-testartifacts ? crunchsmoke #1516
Archived 1 artifacts
Archive block size is 32768
Received 0 blocks and 1521 bytes
Compression is 0.0%
Took 57 ms
[JENKINS] Archiving <https://builds.apache.org/job/Bigtop-trunk-testartifacts/ws/bigtop-tests/test-artifacts/package/pom.xml>
to org.apache.bigtop.itest/package-smoke/0.9.0-SNAPSHOT/package-smoke-0.9.0-SNAPSHOT.pom
Sending artifact delta relative to Bigtop-trunk-testartifacts ? packagesmoke #1516
Archived 1 artifacts
Archive block size is 32768
Received 0 blocks and 2836 bytes
Compression is 0.0%
Took 75 ms
[JENKINS] Archiving <https://builds.apache.org/job/Bigtop-trunk-testartifacts/ws/bigtop-tests/test-artifacts/hive/pom.xml>
to org.apache.bigtop.itest/hive-smoke/0.9.0-SNAPSHOT/hive-smoke-0.9.0-SNAPSHOT.pom
Sending artifact delta relative to Bigtop-trunk-testartifacts ? hivesmoke #1516
Archived 1 artifacts
Archive block size is 32768
Received 0 blocks and 1513 bytes
Compression is 0.0%
Took 2 sec
[JENKINS] Archiving <https://builds.apache.org/job/Bigtop-trunk-testartifacts/ws/bigtop-tests/test-artifacts/flume/pom.xml>
to org.apache.bigtop.itest/flume-smoke/0.9.0-SNAPSHOT/flume-smoke-0.9.0-SNAPSHOT.pom
Sending artifact delta relative to Bigtop-trunk-testartifacts ? flumesmoke #1516
Archived 1 artifacts
Archive block size is 32768
Received 0 blocks and 1677 bytes
Compression is 0.0%
Took 42 ms
[JENKINS] Archiving <https://builds.apache.org/job/Bigtop-trunk-testartifacts/ws/bigtop-tests/test-artifacts/httpfs/pom.xml>
to org.apache.bigtop.itest/httpfs-smoke/0.9.0-SNAPSHOT/httpfs-smoke-0.9.0-SNAPSHOT.pom
Sending artifact delta relative to Bigtop-trunk-testartifacts ? httpfssmokes #1516
Archived 1 artifacts
Archive block size is 32768
Received 0 blocks and 1541 bytes
Compression is 0.0%
Took 60 ms
[JENKINS] Archiving <https://builds.apache.org/job/Bigtop-trunk-testartifacts/ws/bigtop-tests/test-artifacts/spark/pom.xml>
to org.apache.bigtop.itest/spark-smoke/0.9.0-SNAPSHOT/spark-smoke-0.9.0-SNAPSHOT.pom
Sending artifact delta relative to Bigtop-trunk-testartifacts ? sparksmoke #1516
Archived 1 artifacts
Archive block size is 32768
Received 0 blocks and 2266 bytes
Compression is 0.0%
Took 52 ms
[JENKINS] Archiving <https://builds.apache.org/job/Bigtop-trunk-testartifacts/ws/bigtop-tests/test-artifacts/hadoop/pom.xml>
to org.apache.bigtop.itest/hadoop-smoke/0.9.0-SNAPSHOT/hadoop-smoke-0.9.0-SNAPSHOT.pom
Sending artifact delta relative to Bigtop-trunk-testartifacts ? hadoopsmoke #1516
Archived 1 artifacts
Archive block size is 32768
Received 0 blocks and 1953 bytes
Compression is 0.0%
Took 38 ms
[JENKINS] Archiving <https://builds.apache.org/job/Bigtop-trunk-testartifacts/ws/bigtop-tests/test-artifacts/oozie/pom.xml>
to org.apache.bigtop.itest/oozie-smoke/0.9.0-SNAPSHOT/oozie-smoke-0.9.0-SNAPSHOT.pom
Sending artifact delta relative to Bigtop-trunk-testartifacts ? ooziesmoke #1516
Archived 1 artifacts
Archive block size is 32768
Received 0 blocks and 1677 bytes
Compression is 0.0%
Took 64 ms
[JENKINS] Archiving <https://builds.apache.org/job/Bigtop-trunk-testartifacts/ws/bigtop-tests/test-artifacts/giraph/pom.xml>
to org.apache.bigtop.itest/giraph-smoke/0.9.0-SNAPSHOT/giraph-smoke-0.9.0-SNAPSHOT.pom
Sending artifact delta relative to Bigtop-trunk-testartifacts ? giraphsmoke #1516
Archived 1 artifacts
Archive block size is 32768
Received 0 blocks and 1522 bytes
Compression is 0.0%
Took 35 ms
[JENKINS] Archiving <https://builds.apache.org/job/Bigtop-trunk-testartifacts/ws/bigtop-tests/test-artifacts/hcatalog/pom.xml>
to org.apache.bigtop.itest/hcatalog-smoke/0.9.0-SNAPSHOT/hcatalog-smoke-0.9.0-SNAPSHOT.pom
Sending artifact delta relative to Bigtop-trunk-testartifacts ? hcatalogsmoke #1516
Archived 1 artifacts
Archive block size is 32768
Received 0 blocks and 1529 bytes
Compression is 0.0%
Took 40 ms
[JENKINS] Archiving <https://builds.apache.org/job/Bigtop-trunk-testartifacts/ws/bigtop-tests/test-artifacts/datafu/pom.xml>
to org.apache.bigtop.itest/datafu-smoke/0.9.0-SNAPSHOT/datafu-smoke-0.9.0-SNAPSHOT.pom
Sending artifact delta relative to Bigtop-trunk-testartifacts ? datafusmoke #1516
Archived 1 artifacts
Archive block size is 32768
Received 0 blocks and 2405 bytes
Compression is 0.0%
Took 43 ms
[JENKINS] Archiving <https://builds.apache.org/job/Bigtop-trunk-testartifacts/ws/bigtop-tests/test-artifacts/longevity/pom.xml>
to org.apache.bigtop.itest/io-longevity/0.9.0-SNAPSHOT/io-longevity-0.9.0-SNAPSHOT.pom
Sending artifact delta relative to Bigtop-trunk-testartifacts ? io-longevity #1516
Archived 1 artifacts
Archive block size is 32768
Received 0 blocks and 1699 bytes
Compression is 0.0%
Took 59 ms
[JENKINS] Archiving <https://builds.apache.org/job/Bigtop-trunk-testartifacts/ws/bigtop-tests/test-artifacts/mahout/pom.xml>
to org.apache.bigtop.itest/mahout-smoke/0.9.0-SNAPSHOT/mahout-smoke-0.9.0-SNAPSHOT.pom
Sending artifact delta relative to Bigtop-trunk-testartifacts ? mahoutsmoke #1516
Archived 1 artifacts
Archive block size is 32768
Received 0 blocks and 1522 bytes
Compression is 0.0%
Took 25 ms
[JENKINS] Archiving <https://builds.apache.org/job/Bigtop-trunk-testartifacts/ws/bigtop-tests/test-artifacts/solr/pom.xml>
to org.apache.bigtop.itest/solr-smoke/0.9.0-SNAPSHOT/solr-smoke-0.9.0-SNAPSHOT.pom
Sending artifact delta relative to Bigtop-trunk-testartifacts ? solrsmoke #1516
Archived 1 artifacts
Archive block size is 32768
Received 0 blocks and 1784 bytes
Compression is 0.0%
Took 23 ms
[JENKINS] Archiving <https://builds.apache.org/job/Bigtop-trunk-testartifacts/ws/bigtop-tests/test-artifacts/hbase/pom.xml>
to org.apache.bigtop.itest/hbase-smoke/0.9.0-SNAPSHOT/hbase-smoke-0.9.0-SNAPSHOT.pom
Sending artifact delta relative to Bigtop-trunk-testartifacts ? hbasesmoke #1516
Archived 1 artifacts
Archive block size is 32768
Received 0 blocks and 2339 bytes
Compression is 0.0%
Took 52 ms
[JENKINS] Archiving <https://builds.apache.org/job/Bigtop-trunk-testartifacts/ws/bigtop-tests/test-artifacts/phoenix/pom.xml>
to org.apache.bigtop.itest/phoenix-smoke/0.9.0-SNAPSHOT/phoenix-smoke-0.9.0-SNAPSHOT.pom
Sending artifact delta relative to Bigtop-trunk-testartifacts ? phoenixsmoke #1516
Archived 1 artifacts
Archive block size is 32768
Received 0 blocks and 1526 bytes
Compression is 0.0%
Took 31 ms
[JENKINS] Archiving <https://builds.apache.org/job/Bigtop-trunk-testartifacts/ws/bigtop-tests/test-artifacts/fatjar/pom.xml>
to org.apache.bigtop.itest/fat-smoke/0.9.0-SNAPSHOT/fat-smoke-0.9.0-SNAPSHOT.pom
Sending artifact delta relative to Bigtop-trunk-testartifacts ? fatjar #1516
Archived 1 artifacts
Archive block size is 32768
Received 0 blocks and 5446 bytes
Compression is 0.0%
Took 8.4 sec
Sending e-mails to: ci@bigtop.apache.org
channel stopped

Mime
View raw message