bigtop-ci mailing list archives

Site index · List index
Message view « Date » · « Thread »
Top « Date » · « Thread »
From Apache Jenkins Server <jenk...@builds.apache.org>
Subject Build failed in Jenkins: Bigtop-trunk-testartifacts #1515
Date Tue, 07 Oct 2014 22:36:37 GMT
See <https://builds.apache.org/job/Bigtop-trunk-testartifacts/1515/changes>

Changes:

[mark] BIGTOP-1357. Get rid of HCatalog packaging code

------------------------------------------
[...truncated 581 lines...]
	at com.google.inject.internal.InjectorImpl.getProvider(InjectorImpl.java:950)
	at com.google.inject.internal.InjectorImpl.getInstance(InjectorImpl.java:1000)
	at org.sonatype.guice.bean.reflect.AbstractDeferredClass.get(AbstractDeferredClass.java:45)
	at com.google.inject.internal.ProviderInternalFactory.provision(ProviderInternalFactory.java:84)
	at com.google.inject.internal.InternalFactoryToInitializableAdapter.provision(InternalFactoryToInitializableAdapter.java:52)
	at com.google.inject.internal.ProviderInternalFactory$1.call(ProviderInternalFactory.java:70)
	at com.google.inject.internal.ProvisionListenerStackCallback$Provision.provision(ProvisionListenerStackCallback.java:100)
	at org.sonatype.guice.plexus.lifecycles.PlexusLifecycleManager.onProvision(PlexusLifecycleManager.java:138)
	at com.google.inject.internal.ProvisionListenerStackCallback$Provision.provision(ProvisionListenerStackCallback.java:108)
	at com.google.inject.internal.ProvisionListenerStackCallback.provision(ProvisionListenerStackCallback.java:55)
	at com.google.inject.internal.ProviderInternalFactory.circularGet(ProviderInternalFactory.java:68)
	at com.google.inject.internal.InternalFactoryToInitializableAdapter.get(InternalFactoryToInitializableAdapter.java:45)
	at com.google.inject.internal.InjectorImpl$3$1.call(InjectorImpl.java:965)
	at com.google.inject.internal.InjectorImpl.callInContext(InjectorImpl.java:1011)
	at com.google.inject.internal.InjectorImpl$3.get(InjectorImpl.java:961)
	at com.google.inject.Scopes$1$1.get(Scopes.java:59)
	at org.sonatype.guice.bean.locators.LazyBeanEntry.getValue(LazyBeanEntry.java:83)
	at org.sonatype.guice.plexus.locators.LazyPlexusBean.getValue(LazyPlexusBean.java:49)
	at org.codehaus.plexus.DefaultPlexusContainer.lookup(DefaultPlexusContainer.java:253)
	at org.codehaus.plexus.DefaultPlexusContainer.lookup(DefaultPlexusContainer.java:245)
	at org.apache.maven.plugin.internal.DefaultMavenPluginManager.getConfiguredMojo(DefaultMavenPluginManager.java:455)
	at org.apache.maven.plugin.DefaultBuildPluginManager.executeMojo(DefaultBuildPluginManager.java:92)
	at org.apache.maven.lifecycle.internal.MojoExecutor.execute(MojoExecutor.java:209)
	at org.apache.maven.lifecycle.internal.MojoExecutor.execute(MojoExecutor.java:153)
	at org.apache.maven.lifecycle.internal.MojoExecutor.execute(MojoExecutor.java:145)
	at org.apache.maven.lifecycle.internal.LifecycleModuleBuilder.buildProject(LifecycleModuleBuilder.java:84)
	at org.apache.maven.lifecycle.internal.LifecycleModuleBuilder.buildProject(LifecycleModuleBuilder.java:59)
	at org.apache.maven.lifecycle.internal.LifecycleStarter.singleThreadedBuild(LifecycleStarter.java:183)
	at org.apache.maven.lifecycle.internal.LifecycleStarter.execute(LifecycleStarter.java:161)
	at org.apache.maven.DefaultMaven.doExecute(DefaultMaven.java:320)
	at org.apache.maven.DefaultMaven.execute(DefaultMaven.java:156)
	at org.jvnet.hudson.maven3.launcher.Maven3Launcher.main(Maven3Launcher.java:117)
	at sun.reflect.NativeMethodAccessorImpl.invoke0(Native Method)
	at sun.reflect.NativeMethodAccessorImpl.invoke(NativeMethodAccessorImpl.java:39)
	at sun.reflect.DelegatingMethodAccessorImpl.invoke(DelegatingMethodAccessorImpl.java:25)
	at java.lang.reflect.Method.invoke(Method.java:597)
	at org.codehaus.plexus.classworlds.launcher.Launcher.launchStandard(Launcher.java:329)
	at org.codehaus.plexus.classworlds.launcher.Launcher.launch(Launcher.java:239)
	at org.jvnet.hudson.maven3.agent.Maven3Main.launch(Maven3Main.java:178)
	at sun.reflect.NativeMethodAccessorImpl.invoke0(Native Method)
	at sun.reflect.NativeMethodAccessorImpl.invoke(NativeMethodAccessorImpl.java:39)
	at sun.reflect.DelegatingMethodAccessorImpl.invoke(DelegatingMethodAccessorImpl.java:25)
	at java.lang.reflect.Method.invoke(Method.java:597)
	at hudson.maven.Maven3Builder.call(Maven3Builder.java:134)
	at hudson.maven.Maven3Builder.call(Maven3Builder.java:69)
	at hudson.remoting.UserRequest.perform(UserRequest.java:118)
	at hudson.remoting.UserRequest.perform(UserRequest.java:48)
	at hudson.remoting.Request$2.run(Request.java:328)
	at hudson.remoting.InterceptingExecutorService$1.call(InterceptingExecutorService.java:72)
	at java.util.concurrent.FutureTask$Sync.innerRun(FutureTask.java:303)
	at java.util.concurrent.FutureTask.run(FutureTask.java:138)
	at java.util.concurrent.ThreadPoolExecutor$Worker.runTask(ThreadPoolExecutor.java:895)
	at java.util.concurrent.ThreadPoolExecutor$Worker.run(ThreadPoolExecutor.java:918)
	at java.lang.Thread.run(Thread.java:662)
Caused by: java.lang.ClassNotFoundException: org.apache.velocity.context.Context
	at org.codehaus.plexus.classworlds.strategy.SelfFirstStrategy.loadClass(SelfFirstStrategy.java:50)
	at org.codehaus.plexus.classworlds.realm.ClassRealm.loadClass(ClassRealm.java:244)
	at org.codehaus.plexus.classworlds.realm.ClassRealm.loadClass(ClassRealm.java:230)
	... 66 more
[INFO] ------------------------------------------------------------------------
[INFO] Reactor Summary:
[INFO] 
[INFO] bigtop-smokes ..................................... FAILURE [1:12.900s]
[INFO] hadoopsmoke ....................................... SKIPPED
[INFO] packagesmoke ...................................... SKIPPED
[INFO] httpfssmokes ...................................... SKIPPED
[INFO] ooziesmoke ........................................ SKIPPED
[INFO] hivesmoke ......................................... SKIPPED
[INFO] hbasesmoke ........................................ SKIPPED
[INFO] flumesmoke ........................................ SKIPPED
[INFO] sqoopsmokes ....................................... SKIPPED
[INFO] mahoutsmoke ....................................... SKIPPED
[INFO] giraphsmoke ....................................... SKIPPED
[INFO] huesmoke .......................................... SKIPPED
[INFO] solrsmoke ......................................... SKIPPED
[INFO] crunchsmoke ....................................... SKIPPED
[INFO] datafusmoke ....................................... SKIPPED
[INFO] io-longevity ...................................... SKIPPED
[INFO] hcatalogsmoke ..................................... SKIPPED
[INFO] sparksmoke ........................................ SKIPPED
[INFO] phoenixsmoke ...................................... SKIPPED
[INFO] fatjar ............................................ SKIPPED
[INFO] ------------------------------------------------------------------------
[INFO] BUILD FAILURE
[INFO] ------------------------------------------------------------------------
[INFO] Total time: 1:38.039s
[INFO] Finished at: Tue Oct 07 22:35:28 UTC 2014
[INFO] Final Memory: 10M/52M
[INFO] ------------------------------------------------------------------------
Waiting for Jenkins to finish collecting data
[ERROR] Failed to execute goal org.apache.maven.plugins:maven-remote-resources-plugin:1.1:process
(default) on project bigtop-smokes: Execution default of goal org.apache.maven.plugins:maven-remote-resources-plugin:1.1:process
failed: A required class was missing while executing org.apache.maven.plugins:maven-remote-resources-plugin:1.1:process:
org/apache/velocity/context/Context
[ERROR] -----------------------------------------------------
[ERROR] realm =    plugin>org.apache.maven.plugins:maven-remote-resources-plugin:1.1
[ERROR] strategy = org.codehaus.plexus.classworlds.strategy.SelfFirstStrategy
[ERROR] urls[0] = file:/jenkins/maven-repositories/0/org/apache/maven/plugins/maven-remote-resources-plugin/1.1/maven-remote-resources-plugin-1.1.jar
[ERROR] urls[1] = file:/jenkins/maven-repositories/0/org/codehaus/plexus/plexus-utils/1.1/plexus-utils-1.1.jar
[ERROR] Number of foreign imports: 1
[ERROR] import: Entry[import  from realm ClassRealm[project>org.apache.bigtop.itest:bigtop-smokes:0.9.0-SNAPSHOT,
parent: ClassRealm[maven.api, parent: null]]]
[ERROR] 
[ERROR] -----------------------------------------------------: org.apache.velocity.context.Context
[ERROR] -> [Help 1]
[ERROR] 
[ERROR] To see the full stack trace of the errors, re-run Maven with the -e switch.
[ERROR] Re-run Maven using the -X switch to enable full debug logging.
[ERROR] 
[ERROR] For more information about the errors and possible solutions, please read the following
articles:
[ERROR] [Help 1] http://cwiki.apache.org/confluence/display/MAVEN/PluginContainerException
[JENKINS] Archiving <https://builds.apache.org/job/Bigtop-trunk-testartifacts/ws/bigtop-tests/test-artifacts/pom.xml>
to org.apache.bigtop.itest/bigtop-smokes/0.9.0-SNAPSHOT/bigtop-smokes-0.9.0-SNAPSHOT.pom
Sending artifact delta relative to Bigtop-trunk-testartifacts » bigtop-smokes #1514
Archived 1 artifacts
Archive block size is 32768
Received 0 blocks and 4920 bytes
Compression is 0.0%
Took 14 sec
[JENKINS] Archiving <https://builds.apache.org/job/Bigtop-trunk-testartifacts/ws/bigtop-tests/test-artifacts/sqoop/pom.xml>
to org.apache.bigtop.itest/sqoop-smoke/0.9.0-SNAPSHOT/sqoop-smoke-0.9.0-SNAPSHOT.pom
Sending artifact delta relative to Bigtop-trunk-testartifacts » sqoopsmokes #1514
Archived 1 artifacts
Archive block size is 32768
Received 0 blocks and 1837 bytes
Compression is 0.0%
Took 0.3 sec
[JENKINS] Archiving <https://builds.apache.org/job/Bigtop-trunk-testartifacts/ws/bigtop-tests/test-artifacts/hue/pom.xml>
to org.apache.bigtop.itest/hue-smoke/0.9.0-SNAPSHOT/hue-smoke-0.9.0-SNAPSHOT.pom
Sending artifact delta relative to Bigtop-trunk-testartifacts » huesmoke #1514
Archived 1 artifacts
Archive block size is 32768
Received 0 blocks and 1510 bytes
Compression is 0.0%
Took 2.1 sec
[JENKINS] Archiving <https://builds.apache.org/job/Bigtop-trunk-testartifacts/ws/bigtop-tests/test-artifacts/crunch/pom.xml>
to org.apache.bigtop.itest/crunch-smoke/0.9.0-SNAPSHOT/crunch-smoke-0.9.0-SNAPSHOT.pom
Sending artifact delta relative to Bigtop-trunk-testartifacts » crunchsmoke #1514
Archived 1 artifacts
Archive block size is 32768
Received 0 blocks and 1521 bytes
Compression is 0.0%
Took 0.29 sec
[JENKINS] Archiving <https://builds.apache.org/job/Bigtop-trunk-testartifacts/ws/bigtop-tests/test-artifacts/package/pom.xml>
to org.apache.bigtop.itest/package-smoke/0.9.0-SNAPSHOT/package-smoke-0.9.0-SNAPSHOT.pom
Sending artifact delta relative to Bigtop-trunk-testartifacts » packagesmoke #1514
Archived 1 artifacts
Archive block size is 32768
Received 0 blocks and 2836 bytes
Compression is 0.0%
Took 0.22 sec
[JENKINS] Archiving <https://builds.apache.org/job/Bigtop-trunk-testartifacts/ws/bigtop-tests/test-artifacts/hive/pom.xml>
to org.apache.bigtop.itest/hive-smoke/0.9.0-SNAPSHOT/hive-smoke-0.9.0-SNAPSHOT.pom
Sending artifact delta relative to Bigtop-trunk-testartifacts » hivesmoke #1514
Archived 1 artifacts
Archive block size is 32768
Received 0 blocks and 1513 bytes
Compression is 0.0%
Took 0.37 sec
[JENKINS] Archiving <https://builds.apache.org/job/Bigtop-trunk-testartifacts/ws/bigtop-tests/test-artifacts/flume/pom.xml>
to org.apache.bigtop.itest/flume-smoke/0.9.0-SNAPSHOT/flume-smoke-0.9.0-SNAPSHOT.pom
Sending artifact delta relative to Bigtop-trunk-testartifacts » flumesmoke #1514
Archived 1 artifacts
Archive block size is 32768
Received 0 blocks and 1677 bytes
Compression is 0.0%
Took 1.9 sec
[JENKINS] Archiving <https://builds.apache.org/job/Bigtop-trunk-testartifacts/ws/bigtop-tests/test-artifacts/httpfs/pom.xml>
to org.apache.bigtop.itest/httpfs-smoke/0.9.0-SNAPSHOT/httpfs-smoke-0.9.0-SNAPSHOT.pom
Sending artifact delta relative to Bigtop-trunk-testartifacts » httpfssmokes #1514
Archived 1 artifacts
Archive block size is 32768
Received 0 blocks and 1541 bytes
Compression is 0.0%
Took 0.37 sec
[JENKINS] Archiving <https://builds.apache.org/job/Bigtop-trunk-testartifacts/ws/bigtop-tests/test-artifacts/spark/pom.xml>
to org.apache.bigtop.itest/spark-smoke/0.9.0-SNAPSHOT/spark-smoke-0.9.0-SNAPSHOT.pom
Sending artifact delta relative to Bigtop-trunk-testartifacts » sparksmoke #1514
Archived 1 artifacts
Archive block size is 32768
Received 0 blocks and 2266 bytes
Compression is 0.0%
Took 0.22 sec
[JENKINS] Archiving <https://builds.apache.org/job/Bigtop-trunk-testartifacts/ws/bigtop-tests/test-artifacts/hadoop/pom.xml>
to org.apache.bigtop.itest/hadoop-smoke/0.9.0-SNAPSHOT/hadoop-smoke-0.9.0-SNAPSHOT.pom
Sending artifact delta relative to Bigtop-trunk-testartifacts » hadoopsmoke #1514
Archived 1 artifacts
Archive block size is 32768
Received 0 blocks and 1953 bytes
Compression is 0.0%
Took 0.37 sec
[JENKINS] Archiving <https://builds.apache.org/job/Bigtop-trunk-testartifacts/ws/bigtop-tests/test-artifacts/oozie/pom.xml>
to org.apache.bigtop.itest/oozie-smoke/0.9.0-SNAPSHOT/oozie-smoke-0.9.0-SNAPSHOT.pom
Sending artifact delta relative to Bigtop-trunk-testartifacts » ooziesmoke #1514
Archived 1 artifacts
Archive block size is 32768
Received 0 blocks and 1677 bytes
Compression is 0.0%
Took 0.22 sec
[JENKINS] Archiving <https://builds.apache.org/job/Bigtop-trunk-testartifacts/ws/bigtop-tests/test-artifacts/giraph/pom.xml>
to org.apache.bigtop.itest/giraph-smoke/0.9.0-SNAPSHOT/giraph-smoke-0.9.0-SNAPSHOT.pom
Sending artifact delta relative to Bigtop-trunk-testartifacts » giraphsmoke #1514
Archived 1 artifacts
Archive block size is 32768
Received 0 blocks and 1522 bytes
Compression is 0.0%
Took 1.9 sec
[JENKINS] Archiving <https://builds.apache.org/job/Bigtop-trunk-testartifacts/ws/bigtop-tests/test-artifacts/hcatalog/pom.xml>
to org.apache.bigtop.itest/hcatalog-smoke/0.9.0-SNAPSHOT/hcatalog-smoke-0.9.0-SNAPSHOT.pom
Sending artifact delta relative to Bigtop-trunk-testartifacts » hcatalogsmoke #1514
Archived 1 artifacts
Archive block size is 32768
Received 0 blocks and 1529 bytes
Compression is 0.0%
Took 0.29 sec
[JENKINS] Archiving <https://builds.apache.org/job/Bigtop-trunk-testartifacts/ws/bigtop-tests/test-artifacts/datafu/pom.xml>
to org.apache.bigtop.itest/datafu-smoke/0.9.0-SNAPSHOT/datafu-smoke-0.9.0-SNAPSHOT.pom
Sending artifact delta relative to Bigtop-trunk-testartifacts » datafusmoke #1514
Archived 1 artifacts
Archive block size is 32768
Received 0 blocks and 2405 bytes
Compression is 0.0%
Took 0.29 sec
[JENKINS] Archiving <https://builds.apache.org/job/Bigtop-trunk-testartifacts/ws/bigtop-tests/test-artifacts/longevity/pom.xml>
to org.apache.bigtop.itest/io-longevity/0.9.0-SNAPSHOT/io-longevity-0.9.0-SNAPSHOT.pom
Sending artifact delta relative to Bigtop-trunk-testartifacts » io-longevity #1514
Archived 1 artifacts
Archive block size is 32768
Received 0 blocks and 1699 bytes
Compression is 0.0%
Took 0.37 sec
[JENKINS] Archiving <https://builds.apache.org/job/Bigtop-trunk-testartifacts/ws/bigtop-tests/test-artifacts/mahout/pom.xml>
to org.apache.bigtop.itest/mahout-smoke/0.9.0-SNAPSHOT/mahout-smoke-0.9.0-SNAPSHOT.pom
Sending artifact delta relative to Bigtop-trunk-testartifacts » mahoutsmoke #1514
Archived 1 artifacts
Archive block size is 32768
Received 0 blocks and 1522 bytes
Compression is 0.0%
Took 0.29 sec
[JENKINS] Archiving <https://builds.apache.org/job/Bigtop-trunk-testartifacts/ws/bigtop-tests/test-artifacts/solr/pom.xml>
to org.apache.bigtop.itest/solr-smoke/0.9.0-SNAPSHOT/solr-smoke-0.9.0-SNAPSHOT.pom
Sending artifact delta relative to Bigtop-trunk-testartifacts » solrsmoke #1514
Archived 1 artifacts
Archive block size is 32768
Received 0 blocks and 1784 bytes
Compression is 0.0%
Took 0.29 sec
[JENKINS] Archiving <https://builds.apache.org/job/Bigtop-trunk-testartifacts/ws/bigtop-tests/test-artifacts/hbase/pom.xml>
to org.apache.bigtop.itest/hbase-smoke/0.9.0-SNAPSHOT/hbase-smoke-0.9.0-SNAPSHOT.pom
Sending artifact delta relative to Bigtop-trunk-testartifacts » hbasesmoke #1514
Archived 1 artifacts
Archive block size is 32768
Received 0 blocks and 2339 bytes
Compression is 0.0%
Took 0.26 sec
[JENKINS] Archiving <https://builds.apache.org/job/Bigtop-trunk-testartifacts/ws/bigtop-tests/test-artifacts/phoenix/pom.xml>
to org.apache.bigtop.itest/phoenix-smoke/0.9.0-SNAPSHOT/phoenix-smoke-0.9.0-SNAPSHOT.pom
Sending artifact delta relative to Bigtop-trunk-testartifacts » phoenixsmoke #1514
Archived 1 artifacts
Archive block size is 32768
Received 0 blocks and 1526 bytes
Compression is 0.0%
Took 0.36 sec
[JENKINS] Archiving <https://builds.apache.org/job/Bigtop-trunk-testartifacts/ws/bigtop-tests/test-artifacts/fatjar/pom.xml>
to org.apache.bigtop.itest/fat-smoke/0.9.0-SNAPSHOT/fat-smoke-0.9.0-SNAPSHOT.pom
Sending artifact delta relative to Bigtop-trunk-testartifacts » fatjar #1514
Archived 1 artifacts
Archive block size is 32768
Received 0 blocks and 5446 bytes
Compression is 0.0%
Took 3.5 sec
Sending e-mails to: ci@bigtop.apache.org
channel stopped

Mime
View raw message