bigtop-ci mailing list archives

Site index · List index
Message view « Date » · « Thread »
Top « Date » · « Thread »
From Apache Jenkins Server <jenk...@builds.apache.org>
Subject Build failed in Jenkins: Bigtop-trunk-testartifacts » hadoopsmoke #1518
Date Tue, 14 Oct 2014 15:02:04 GMT
See <https://builds.apache.org/job/Bigtop-trunk-testartifacts/org.apache.bigtop.itest$hadoop-smoke/1518/>

------------------------------------------
[INFO]                                                                         
[INFO] ------------------------------------------------------------------------
[INFO] Building hadoopsmoke 0.9.0-SNAPSHOT
[INFO] ------------------------------------------------------------------------
Downloading: http://repo.maven.apache.org/maven2/org/apache/hadoop/hadoop-common/2.4.1/hadoop-common-2.4.1.pom
Downloaded: http://repo.maven.apache.org/maven2/org/apache/hadoop/hadoop-common/2.4.1/hadoop-common-2.4.1.pom
(28 KB at 194.3 KB/sec)
Downloading: http://repo.maven.apache.org/maven2/org/apache/hadoop/hadoop-project-dist/2.4.1/hadoop-project-dist-2.4.1.pom
Downloaded: http://repo.maven.apache.org/maven2/org/apache/hadoop/hadoop-project-dist/2.4.1/hadoop-project-dist-2.4.1.pom
(18 KB at 233.5 KB/sec)
Downloading: http://repo.maven.apache.org/maven2/org/apache/hadoop/hadoop-project/2.4.1/hadoop-project-2.4.1.pom
Downloaded: http://repo.maven.apache.org/maven2/org/apache/hadoop/hadoop-project/2.4.1/hadoop-project-2.4.1.pom
(38 KB at 356.5 KB/sec)
Downloading: http://repo.maven.apache.org/maven2/org/apache/hadoop/hadoop-main/2.4.1/hadoop-main-2.4.1.pom
Downloaded: http://repo.maven.apache.org/maven2/org/apache/hadoop/hadoop-main/2.4.1/hadoop-main-2.4.1.pom
(18 KB at 241.4 KB/sec)
Downloading: http://repo.maven.apache.org/maven2/org/apache/hadoop/hadoop-annotations/2.4.1/hadoop-annotations-2.4.1.pom
Downloaded: http://repo.maven.apache.org/maven2/org/apache/hadoop/hadoop-annotations/2.4.1/hadoop-annotations-2.4.1.pom
(3 KB at 31.5 KB/sec)
Downloading: http://repo.maven.apache.org/maven2/org/apache/hadoop/hadoop-auth/2.4.1/hadoop-auth-2.4.1.pom
Downloaded: http://repo.maven.apache.org/maven2/org/apache/hadoop/hadoop-auth/2.4.1/hadoop-auth-2.4.1.pom
(6 KB at 71.6 KB/sec)
Downloading: http://repo.maven.apache.org/maven2/org/apache/hadoop/hadoop-hdfs/2.4.1/hadoop-hdfs-2.4.1.pom
Downloaded: http://repo.maven.apache.org/maven2/org/apache/hadoop/hadoop-hdfs/2.4.1/hadoop-hdfs-2.4.1.pom
(26 KB at 240.4 KB/sec)
Downloading: http://repo.maven.apache.org/maven2/org/apache/hadoop/hadoop-common/2.4.1/hadoop-common-2.4.1.jar
Downloading: http://repo.maven.apache.org/maven2/org/apache/hadoop/hadoop-annotations/2.4.1/hadoop-annotations-2.4.1.jar
Downloading: http://repo.maven.apache.org/maven2/org/apache/hadoop/hadoop-auth/2.4.1/hadoop-auth-2.4.1.jar
Downloading: http://repo.maven.apache.org/maven2/org/apache/hadoop/hadoop-common/2.4.1/hadoop-common-2.4.1-tests.jar
Downloading: http://repo.maven.apache.org/maven2/org/apache/hadoop/hadoop-hdfs/2.4.1/hadoop-hdfs-2.4.1.jar
Downloaded: http://repo.maven.apache.org/maven2/org/apache/hadoop/hadoop-annotations/2.4.1/hadoop-annotations-2.4.1.jar
(17 KB at 111.7 KB/sec)
Downloaded: http://repo.maven.apache.org/maven2/org/apache/hadoop/hadoop-auth/2.4.1/hadoop-auth-2.4.1.jar
(50 KB at 269.6 KB/sec)
Downloaded: http://repo.maven.apache.org/maven2/org/apache/hadoop/hadoop-common/2.4.1/hadoop-common-2.4.1.jar
(2841 KB at 4098.9 KB/sec)
Downloaded: http://repo.maven.apache.org/maven2/org/apache/hadoop/hadoop-common/2.4.1/hadoop-common-2.4.1-tests.jar
(1476 KB at 2119.8 KB/sec)
Downloaded: http://repo.maven.apache.org/maven2/org/apache/hadoop/hadoop-hdfs/2.4.1/hadoop-hdfs-2.4.1.jar
(6670 KB at 6210.1 KB/sec)
[INFO] 
[INFO] --- maven-clean-plugin:2.4.1:clean (default-clean) @ hadoop-smoke ---
[INFO] Deleting <https://builds.apache.org/job/Bigtop-trunk-testartifacts/org.apache.bigtop.itest$hadoop-smoke/ws/target>
[INFO] 
[INFO] --- groovy-eclipse-compiler:2.8.0-01:add-groovy-build-paths (default-add-groovy-build-paths)
@ hadoop-smoke ---
[INFO] Adding /src/main/groovy to the list of source folders
[INFO] Adding /src/test/groovy to the list of test source folders
[INFO] 
[INFO] --- maven-remote-resources-plugin:1.1:process (default) @ hadoop-smoke ---
[INFO] 
[INFO] --- maven-resources-plugin:2.4.3:resources (default-resources) @ hadoop-smoke ---
[INFO] Using 'UTF-8' encoding to copy filtered resources.
[INFO] Copying 16 resources
[INFO] Copying 3 resources
[INFO] 
[INFO] --- maven-compiler-plugin:3.1:compile (default-compile) @ hadoop-smoke ---
[INFO] Changes detected - recompiling the module!
[INFO] Using Groovy-Eclipse compiler to compile both Java and Groovy files
org.codehaus.groovy.control.messages.SyntaxErrorMessage@11f578c
org.codehaus.groovy.control.messages.SyntaxErrorMessage@acb63d
<https://builds.apache.org/job/Bigtop-trunk-testartifacts/org.apache.bigtop.itest$hadoop-smoke/ws/src/main/groovy/org/apache/bigtop/itest/hadoop/mapreduce/TestHadoopExamples.groovy>:
160 Groovy:unable to resolve class FailureExecutor 
<https://builds.apache.org/job/Bigtop-trunk-testartifacts/org.apache.bigtop.itest$hadoop-smoke/ws/src/main/groovy/org/apache/bigtop/itest/hadoop/mapreduce/TestHadoopExamples.groovy>:
160 Groovy:unable to resolve class FailureExecutor 
[INFO] -------------------------------------------------------------
[ERROR] COMPILATION ERROR : 
[INFO] -------------------------------------------------------------
[ERROR] <https://builds.apache.org/job/Bigtop-trunk-testartifacts/org.apache.bigtop.itest$hadoop-smoke/ws/src/main/groovy/org/apache/bigtop/itest/hadoop/mapreduce/TestHadoopExamples.groovy>:[160,1]
1. ERROR in <https://builds.apache.org/job/Bigtop-trunk-testartifacts/org.apache.bigtop.itest$hadoop-smoke/ws/src/main/groovy/org/apache/bigtop/itest/hadoop/mapreduce/TestHadoopExamples.groovy>
(at line 160)
	FailureExecutor failureExecutor = new FailureExecutor();
	^^^^^^^^^^^^^^^
Groovy:unable to resolve class FailureExecutor 

[ERROR] <https://builds.apache.org/job/Bigtop-trunk-testartifacts/org.apache.bigtop.itest$hadoop-smoke/ws/src/main/groovy/org/apache/bigtop/itest/hadoop/mapreduce/TestHadoopExamples.groovy>:[160,39]
2. ERROR in <https://builds.apache.org/job/Bigtop-trunk-testartifacts/org.apache.bigtop.itest$hadoop-smoke/ws/src/main/groovy/org/apache/bigtop/itest/hadoop/mapreduce/TestHadoopExamples.groovy>
(at line 160)
	FailureExecutor failureExecutor = new FailureExecutor();
	                                      ^^^^^^^^^^^^^^^
Groovy:unable to resolve class FailureExecutor 

[ERROR] Found 2 errors and 0 warnings.
[INFO] 3 errors 
[INFO] -------------------------------------------------------------

Mime
View raw message