bigtop-ci mailing list archives

Site index · List index
Message view « Date » · « Thread »
Top « Date » · « Thread »
From Apache Jenkins Server <jenk...@builds.apache.org>
Subject Build failed in Jenkins: Bigtop-trunk-test-execution #1339
Date Sat, 27 Sep 2014 04:07:07 GMT
See <https://builds.apache.org/job/Bigtop-trunk-test-execution/1339/changes>

Changes:

[cos] BIGTOP-1462. Failed to build spark by gradle

------------------------------------------
[...truncated 2088 lines...]
5372/6230 KB   
5376/6230 KB   
5380/6230 KB   
5384/6230 KB   
5388/6230 KB   
5392/6230 KB   
5396/6230 KB   
5400/6230 KB   
5404/6230 KB   
5408/6230 KB   
5412/6230 KB   
5416/6230 KB   
5420/6230 KB   
5424/6230 KB   
5428/6230 KB   
5432/6230 KB   
5436/6230 KB   
5440/6230 KB   
5444/6230 KB   
5448/6230 KB   
5452/6230 KB   
5456/6230 KB   
5460/6230 KB   
5464/6230 KB   
5468/6230 KB   
5472/6230 KB   
5476/6230 KB   
5480/6230 KB   
5484/6230 KB   
5488/6230 KB   
5492/6230 KB   
5496/6230 KB   
5500/6230 KB   
5504/6230 KB   
5508/6230 KB   
5512/6230 KB   
5516/6230 KB   
5520/6230 KB   
5524/6230 KB   
5528/6230 KB   
5532/6230 KB   
5536/6230 KB   
5540/6230 KB   
5544/6230 KB   
5548/6230 KB   
5552/6230 KB   
5556/6230 KB   
5560/6230 KB   
5564/6230 KB   
5568/6230 KB   
5572/6230 KB   
5576/6230 KB   
5580/6230 KB   
5584/6230 KB   
5588/6230 KB   
5592/6230 KB   
5596/6230 KB   
5600/6230 KB   
5604/6230 KB   
5608/6230 KB   
5612/6230 KB   
5616/6230 KB   
5620/6230 KB   
5624/6230 KB   
5628/6230 KB   
5632/6230 KB   
5636/6230 KB   
5640/6230 KB   
5644/6230 KB   
5648/6230 KB   
5652/6230 KB   
5656/6230 KB   
5660/6230 KB   
5664/6230 KB   
5668/6230 KB   
5672/6230 KB   
5676/6230 KB   
5680/6230 KB   
5684/6230 KB   
5688/6230 KB   
5692/6230 KB   
5696/6230 KB   
5700/6230 KB   
5704/6230 KB   
5708/6230 KB   
5712/6230 KB   
5716/6230 KB   
5720/6230 KB   
5724/6230 KB   
5728/6230 KB   
5732/6230 KB   
5736/6230 KB   
5740/6230 KB   
5744/6230 KB   
5748/6230 KB   
5752/6230 KB   
5756/6230 KB   
5760/6230 KB   
5764/6230 KB   
5768/6230 KB   
5772/6230 KB   
5776/6230 KB   
5780/6230 KB   
5784/6230 KB   
5788/6230 KB   
5792/6230 KB   
5793/6230 KB   
5797/6230 KB   
5801/6230 KB   
5805/6230 KB   
5809/6230 KB   
5813/6230 KB   
5817/6230 KB   
5821/6230 KB   
5825/6230 KB   
5829/6230 KB   
5833/6230 KB   
5837/6230 KB   
5841/6230 KB   
5845/6230 KB   
5849/6230 KB   
5853/6230 KB   
5857/6230 KB   
5861/6230 KB   
5865/6230 KB   
5869/6230 KB   
5873/6230 KB   
5877/6230 KB   
5881/6230 KB   
5885/6230 KB   
5889/6230 KB   
5893/6230 KB   
5897/6230 KB   
5901/6230 KB   
5905/6230 KB   
5909/6230 KB   
5913/6230 KB   
5917/6230 KB   
5921/6230 KB   
5925/6230 KB   
5929/6230 KB   
5933/6230 KB   
5937/6230 KB   
5941/6230 KB   
5945/6230 KB   
5949/6230 KB   
5953/6230 KB   
5957/6230 KB   
5961/6230 KB   
5965/6230 KB   
5969/6230 KB   
5973/6230 KB   
5977/6230 KB   
5981/6230 KB   
5985/6230 KB   
5989/6230 KB   
5993/6230 KB   
5997/6230 KB   
6001/6230 KB   
6005/6230 KB   
6009/6230 KB   
6013/6230 KB   
6017/6230 KB   
6021/6230 KB   
6025/6230 KB   
6029/6230 KB   
6033/6230 KB   
6037/6230 KB   
6041/6230 KB   
6045/6230 KB   
6049/6230 KB   
6053/6230 KB   
6057/6230 KB   
6061/6230 KB   
6065/6230 KB   
6069/6230 KB   
6073/6230 KB   
6077/6230 KB   
6081/6230 KB   
6085/6230 KB   
6089/6230 KB   
6093/6230 KB   
6097/6230 KB   
6101/6230 KB   
6105/6230 KB   
6109/6230 KB   
6113/6230 KB   
6117/6230 KB   
6121/6230 KB   
6125/6230 KB   
6129/6230 KB   
6133/6230 KB   
6137/6230 KB   
6141/6230 KB   
6145/6230 KB   
6149/6230 KB   
6153/6230 KB   
6157/6230 KB   
6161/6230 KB   
6165/6230 KB   
6169/6230 KB   
6173/6230 KB   
6177/6230 KB   
6181/6230 KB   
6185/6230 KB   
6189/6230 KB   
6193/6230 KB   
6197/6230 KB   
6201/6230 KB   
6205/6230 KB   
6209/6230 KB   
6213/6230 KB   
6217/6230 KB   
6221/6230 KB   
6225/6230 KB   
6229/6230 KB   
6230/6230 KB   
               
Downloaded: http://repo.maven.apache.org/maven2/org/codehaus/groovy/groovy-all/2.1.8/groovy-all-2.1.8.jar
(6230 KB at 11753.9 KB/sec)
[INFO] 
[INFO] --- maven-install-plugin:2.3:install (default-install) @ stacks-common ---
[INFO] Installing <https://builds.apache.org/job/Bigtop-trunk-test-execution/ws/bigtop-tests/test-execution/common/pom.xml>
to /home/jenkins/.m2/repository/org/apache/bigtop/itest/stacks-common/0.9.0-SNAPSHOT/stacks-common-0.9.0-SNAPSHOT.pom
[INFO] 
[INFO] --- maven-deploy-plugin:2.5:deploy (default-deploy) @ stacks-common ---
Downloading: https://repository.apache.org/content/repositories/snapshots/org/apache/bigtop/itest/stacks-common/0.9.0-SNAPSHOT/maven-metadata.xml
               
[WARNING] Could not transfer metadata org.apache.bigtop.itest:stacks-common:0.9.0-SNAPSHOT/maven-metadata.xml
from/to apache.snapshots.https (https://repository.apache.org/content/repositories/snapshots):
Not authorized, ReasonPhrase:Unauthorized.
[INFO] ------------------------------------------------------------------------
[INFO] Reactor Summary:
[INFO] 
[INFO] stacks-validation-common .......................... FAILURE [4.435s]
[INFO] smoke-tests-conf .................................. SKIPPED
[INFO] packagesmokes ..................................... SKIPPED
[INFO] bigtop-smokes ..................................... SKIPPED
[INFO] ------------------------------------------------------------------------
[INFO] BUILD FAILURE
[INFO] ------------------------------------------------------------------------
[INFO] Total time: 4.892s
[INFO] Finished at: Sat Sep 27 04:07:04 UTC 2014
[INFO] Final Memory: 8M/109M
[INFO] ------------------------------------------------------------------------
[ERROR] Failed to execute goal org.apache.maven.plugins:maven-deploy-plugin:2.5:deploy (default-deploy)
on project stacks-common: Failed to retrieve remote metadata org.apache.bigtop.itest:stacks-common:0.9.0-SNAPSHOT/maven-metadata.xml:
Could not transfer metadata org.apache.bigtop.itest:stacks-common:0.9.0-SNAPSHOT/maven-metadata.xml
from/to apache.snapshots.https (https://repository.apache.org/content/repositories/snapshots):
Not authorized, ReasonPhrase:Unauthorized. -> [Help 1]
[ERROR] 
[ERROR] To see the full stack trace of the errors, re-run Maven with the -e switch.
[ERROR] Re-run Maven using the -X switch to enable full debug logging.
[ERROR] 
[ERROR] For more information about the errors and possible solutions, please read the following
articles:
[ERROR] [Help 1] http://cwiki.apache.org/confluence/display/MAVEN/MojoExecutionException
Build step 'Execute shell' marked build as failure

Mime
View raw message