bigtop-ci mailing list archives

Site index · List index
Message view « Date » · « Thread »
Top « Date » · « Thread »
From Apache Jenkins Server <jenk...@builds.apache.org>
Subject Build failed in Jenkins: Bigtop-trunk-testartifacts #1491
Date Sat, 06 Sep 2014 02:40:36 GMT
See <https://builds.apache.org/job/Bigtop-trunk-testartifacts/1491/changes>

Changes:

[rvs] BIGTOP-1426. Bump version of Hadoop to 2.4.1

[rvs] BIGTOP-1429. Apache build of Bigtop test artifacts fails to find correct Hbase jars

------------------------------------------
[...truncated 1685 lines...]
[INFO] No sources to compile
[INFO] 
[INFO] --- maven-surefire-plugin:2.7:test (default-test) @ io-longevity ---
[INFO] Tests are skipped.
[INFO] 
[INFO] --- maven-jar-plugin:2.2:jar (default-jar) @ io-longevity ---
[INFO] Building jar: <https://builds.apache.org/job/Bigtop-trunk-testartifacts/ws/bigtop-tests/test-artifacts/longevity/target/io-longevity-0.8.0-SNAPSHOT.jar>
[INFO]                                                                         
[INFO] >>>>>>>>>>>>>>>>>>>>>>>>>>>>>>>>>>>>>>>>>>>>>>>>>>>>>>>>>>>>>>>>>>>>>>>>
[INFO] Forking hcatalogsmoke 0.8.0-SNAPSHOT
[INFO] >>>>>>>>>>>>>>>>>>>>>>>>>>>>>>>>>>>>>>>>>>>>>>>>>>>>>>>>>>>>>>>>>>>>>>>>
[INFO] 
[INFO] --- groovy-eclipse-compiler:2.8.0-01:add-groovy-build-paths (default-add-groovy-build-paths)
@ hcatalog-smoke ---
[INFO] Adding /src/main/groovy to the list of source folders
[INFO] Adding /src/test/groovy to the list of test source folders
[INFO] 
[INFO] --- maven-remote-resources-plugin:1.1:process (default) @ hcatalog-smoke ---
[INFO] 
[INFO] --- maven-resources-plugin:2.4.3:resources (default-resources) @ hcatalog-smoke ---
[INFO] Using 'UTF-8' encoding to copy filtered resources.
[INFO] Copying 5 resources
[INFO] Copying 3 resources
[INFO] 
[INFO] --- maven-compiler-plugin:3.1:compile (default-compile) @ hcatalog-smoke ---
[INFO] Changes detected - recompiling the module!
[INFO] Using Groovy-Eclipse compiler to compile both Java and Groovy files
[INFO] 
[INFO] --- maven-resources-plugin:2.4.3:testResources (default-testResources) @ hcatalog-smoke
---
[INFO] Using 'UTF-8' encoding to copy filtered resources.
[INFO] skip non existing resourceDirectory <https://builds.apache.org/job/Bigtop-trunk-testartifacts/ws/bigtop-tests/test-artifacts/hcatalog/src/test/resources>
[INFO] Copying 3 resources
[INFO] 
[INFO] --- maven-compiler-plugin:3.1:testCompile (default-testCompile) @ hcatalog-smoke ---
[INFO] No sources to compile
[INFO] 
[INFO] --- maven-surefire-plugin:2.7:test (default-test) @ hcatalog-smoke ---
[INFO] Tests are skipped.
[INFO] 
[INFO] --- maven-jar-plugin:2.2:jar (default-jar) @ hcatalog-smoke ---
[INFO] Building jar: <https://builds.apache.org/job/Bigtop-trunk-testartifacts/ws/bigtop-tests/test-artifacts/hcatalog/target/hcatalog-smoke-0.8.0-SNAPSHOT.jar>
[INFO]                                                                         
[INFO] >>>>>>>>>>>>>>>>>>>>>>>>>>>>>>>>>>>>>>>>>>>>>>>>>>>>>>>>>>>>>>>>>>>>>>>>
[INFO] Forking sparksmoke 0.8.0-SNAPSHOT
[INFO] >>>>>>>>>>>>>>>>>>>>>>>>>>>>>>>>>>>>>>>>>>>>>>>>>>>>>>>>>>>>>>>>>>>>>>>>
Downloading: http://repo.akka.io/releases/org/apache/spark/spark-core_2.9.3/0.9.1/spark-core_2.9.3-0.9.1.pom
Downloading: http://repo.maven.apache.org/maven2/org/apache/spark/spark-core_2.9.3/0.9.1/spark-core_2.9.3-0.9.1.pom
[WARNING] The POM for org.apache.spark:spark-core_2.9.3:jar:0.9.1 is missing, no dependency
information available
Downloading: http://repo.akka.io/releases/org/apache/spark/spark-core_2.9.3/0.9.1/spark-core_2.9.3-0.9.1.jar
Downloading: http://repo.maven.apache.org/maven2/org/apache/spark/spark-core_2.9.3/0.9.1/spark-core_2.9.3-0.9.1.jar
[WARNING] Failed to getClass for org.apache.maven.plugin.assembly.mojos.AssemblyMojo
[INFO] ------------------------------------------------------------------------
[INFO] Reactor Summary:
[INFO] 
[INFO] bigtop-smokes ..................................... SUCCESS [44.796s]
[INFO] hadoopsmoke ....................................... SUCCESS [17.573s]
[INFO] packagesmoke ...................................... SUCCESS [14.616s]
[INFO] httpfssmokes ...................................... SUCCESS [8.674s]
[INFO] ooziesmoke ........................................ SUCCESS [9.106s]
[INFO] hivesmoke ......................................... SUCCESS [9.599s]
[INFO] hbasesmoke ........................................ SUCCESS [18.115s]
[INFO] flumesmoke ........................................ SUCCESS [11.111s]
[INFO] sqoopsmokes ....................................... SUCCESS [11.775s]
[INFO] mahoutsmoke ....................................... SUCCESS [8.504s]
[INFO] giraphsmoke ....................................... SUCCESS [8.028s]
[INFO] huesmoke .......................................... SUCCESS [5.514s]
[INFO] solrsmoke ......................................... SUCCESS [8.617s]
[INFO] crunchsmoke ....................................... SUCCESS [8.560s]
[INFO] datafusmoke ....................................... SUCCESS [14.232s]
[INFO] fatjar ............................................ FAILURE [1:08.675s]
[INFO] io-longevity ...................................... SKIPPED
[INFO] hcatalogsmoke ..................................... SKIPPED
[INFO] sparksmoke ........................................ SKIPPED
[INFO] phoenixsmoke ...................................... SKIPPED
[INFO] ------------------------------------------------------------------------
[INFO] BUILD FAILURE
[INFO] ------------------------------------------------------------------------
[INFO] Total time: 4:50.335s
[INFO] Finished at: Sat Sep 06 02:39:44 UTC 2014
[INFO] Final Memory: 36M/193M
[INFO] ------------------------------------------------------------------------
Waiting for Jenkins to finish collecting data
[ERROR] Failed to execute goal on project spark-smoke: Could not resolve dependencies for
project org.apache.bigtop.itest:spark-smoke:jar:0.8.0-SNAPSHOT: Could not find artifact org.apache.spark:spark-core_2.9.3:jar:0.9.1
in akka-repo (http://repo.akka.io/releases/) -> [Help 1]
[ERROR] 
[ERROR] To see the full stack trace of the errors, re-run Maven with the -e switch.
[ERROR] Re-run Maven using the -X switch to enable full debug logging.
[ERROR] 
[ERROR] For more information about the errors and possible solutions, please read the following
articles:
[ERROR] [Help 1] http://cwiki.apache.org/confluence/display/MAVEN/DependencyResolutionException
[ERROR] 
[ERROR] After correcting the problems, you can resume the build with the command
[ERROR]   mvn <goals> -rf :spark-smoke
[JENKINS] Archiving <https://builds.apache.org/job/Bigtop-trunk-testartifacts/ws/bigtop-tests/test-artifacts/pom.xml>
to org.apache.bigtop.itest/bigtop-smokes/0.8.0-SNAPSHOT/bigtop-smokes-0.8.0-SNAPSHOT.pom
Sending artifact delta relative to Bigtop-trunk-testartifacts ? bigtop-smokes #1490
Archived 1 artifacts
Archive block size is 32768
Received 0 blocks and 4920 bytes
Compression is 0.0%
Took 0.11 sec
[JENKINS] Archiving <https://builds.apache.org/job/Bigtop-trunk-testartifacts/ws/bigtop-tests/test-artifacts/sqoop/pom.xml>
to org.apache.bigtop.itest/sqoop-smoke/0.8.0-SNAPSHOT/sqoop-smoke-0.8.0-SNAPSHOT.pom
[JENKINS] Archiving <https://builds.apache.org/job/Bigtop-trunk-testartifacts/ws/bigtop-tests/test-artifacts/sqoop/target/sqoop-smoke-0.8.0-SNAPSHOT.jar>
to org.apache.bigtop.itest/sqoop-smoke/0.8.0-20140906.023734-21/sqoop-smoke-0.8.0-20140906.023734-21.jar
Sending artifact delta relative to Bigtop-trunk-testartifacts ? sqoopsmokes #1422
Archived 2 artifacts
Archive block size is 32768
Received 0 blocks and 50633 bytes
Compression is 0.0%
Took 0.15 sec
[JENKINS] Archiving <https://builds.apache.org/job/Bigtop-trunk-testartifacts/ws/bigtop-tests/test-artifacts/hue/pom.xml>
to org.apache.bigtop.itest/hue-smoke/0.8.0-SNAPSHOT/hue-smoke-0.8.0-SNAPSHOT.pom
[JENKINS] Archiving <https://builds.apache.org/job/Bigtop-trunk-testartifacts/ws/bigtop-tests/test-artifacts/hue/target/hue-smoke-0.8.0-SNAPSHOT.jar>
to org.apache.bigtop.itest/hue-smoke/0.8.0-20140906.023800-21/hue-smoke-0.8.0-20140906.023800-21.jar
Sending artifact delta relative to Bigtop-trunk-testartifacts ? huesmoke #1422
Archived 2 artifacts
Archive block size is 32768
Received 0 blocks and 15888 bytes
Compression is 0.0%
Took 2.1 sec
[JENKINS] Archiving <https://builds.apache.org/job/Bigtop-trunk-testartifacts/ws/bigtop-tests/test-artifacts/crunch/pom.xml>
to org.apache.bigtop.itest/crunch-smoke/0.8.0-SNAPSHOT/crunch-smoke-0.8.0-SNAPSHOT.pom
[JENKINS] Archiving <https://builds.apache.org/job/Bigtop-trunk-testartifacts/ws/bigtop-tests/test-artifacts/crunch/target/crunch-smoke-0.8.0-SNAPSHOT.jar>
to org.apache.bigtop.itest/crunch-smoke/0.8.0-20140906.023817-21/crunch-smoke-0.8.0-20140906.023817-21.jar
Sending artifact delta relative to Bigtop-trunk-testartifacts ? crunchsmoke #1422
Archived 2 artifacts
Archive block size is 32768
Received 7 blocks and 97558 bytes
Compression is 70.2%
Took 0.15 sec
[JENKINS] Archiving <https://builds.apache.org/job/Bigtop-trunk-testartifacts/ws/bigtop-tests/test-artifacts/package/pom.xml>
to org.apache.bigtop.itest/package-smoke/0.8.0-SNAPSHOT/package-smoke-0.8.0-SNAPSHOT.pom
[JENKINS] Archiving <https://builds.apache.org/job/Bigtop-trunk-testartifacts/ws/bigtop-tests/test-artifacts/package/target/package-smoke-0.8.0-SNAPSHOT.jar>
to org.apache.bigtop.itest/package-smoke/0.8.0-20140906.023617-84/package-smoke-0.8.0-20140906.023617-84.jar
Sending artifact delta relative to Bigtop-trunk-testartifacts ? packagesmoke #1490
Archived 2 artifacts
Archive block size is 32768
Received 2 blocks and 759119 bytes
Compression is 7.9%
Took 2.3 sec
[JENKINS] Archiving <https://builds.apache.org/job/Bigtop-trunk-testartifacts/ws/bigtop-tests/test-artifacts/hive/pom.xml>
to org.apache.bigtop.itest/hive-smoke/0.8.0-SNAPSHOT/hive-smoke-0.8.0-SNAPSHOT.pom
[JENKINS] Archiving <https://builds.apache.org/job/Bigtop-trunk-testartifacts/ws/bigtop-tests/test-artifacts/hive/target/hive-smoke-0.8.0-SNAPSHOT.jar>
to org.apache.bigtop.itest/hive-smoke/0.8.0-20140906.023651-84/hive-smoke-0.8.0-20140906.023651-84.jar
Sending artifact delta relative to Bigtop-trunk-testartifacts ? hivesmoke #1490
Archived 2 artifacts
Archive block size is 32768
Received 0 blocks and 139639 bytes
Compression is 0.0%
Took 0.22 sec
[JENKINS] Archiving <https://builds.apache.org/job/Bigtop-trunk-testartifacts/ws/bigtop-tests/test-artifacts/flume/pom.xml>
to org.apache.bigtop.itest/flume-smoke/0.8.0-SNAPSHOT/flume-smoke-0.8.0-SNAPSHOT.pom
[JENKINS] Archiving <https://builds.apache.org/job/Bigtop-trunk-testartifacts/ws/bigtop-tests/test-artifacts/flume/target/flume-smoke-0.8.0-SNAPSHOT.jar>
to org.apache.bigtop.itest/flume-smoke/0.8.0-20140906.023721-21/flume-smoke-0.8.0-20140906.023721-21.jar
Sending artifact delta relative to Bigtop-trunk-testartifacts ? flumesmoke #1422
Archived 2 artifacts
Archive block size is 32768
Received 0 blocks and 42431 bytes
Compression is 0.0%
Took 0.17 sec
[JENKINS] Archiving <https://builds.apache.org/job/Bigtop-trunk-testartifacts/ws/bigtop-tests/test-artifacts/httpfs/pom.xml>
to org.apache.bigtop.itest/httpfs-smoke/0.8.0-SNAPSHOT/httpfs-smoke-0.8.0-SNAPSHOT.pom
[JENKINS] Archiving <https://builds.apache.org/job/Bigtop-trunk-testartifacts/ws/bigtop-tests/test-artifacts/httpfs/target/httpfs-smoke-0.8.0-SNAPSHOT.jar>
to org.apache.bigtop.itest/httpfs-smoke/0.8.0-20140906.023627-66/httpfs-smoke-0.8.0-20140906.023627-66.jar
Sending artifact delta relative to Bigtop-trunk-testartifacts ? httpfssmokes #1490
Archived 2 artifacts
Archive block size is 32768
Received 0 blocks and 17699 bytes
Compression is 0.0%
Took 0.18 sec
[JENKINS] Archiving <https://builds.apache.org/job/Bigtop-trunk-testartifacts/ws/bigtop-tests/test-artifacts/spark/pom.xml>
to org.apache.bigtop.itest/spark-smoke/0.8.0-SNAPSHOT/spark-smoke-0.8.0-SNAPSHOT.pom
Sending artifact delta relative to Bigtop-trunk-testartifacts ? sparksmoke #1422
Archived 1 artifacts
Archive block size is 32768
Received 0 blocks and 2267 bytes
Compression is 0.0%
Took 0.14 sec
[JENKINS] Archiving <https://builds.apache.org/job/Bigtop-trunk-testartifacts/ws/bigtop-tests/test-artifacts/hadoop/pom.xml>
to org.apache.bigtop.itest/hadoop-smoke/0.8.0-SNAPSHOT/hadoop-smoke-0.8.0-SNAPSHOT.pom
[JENKINS] Archiving <https://builds.apache.org/job/Bigtop-trunk-testartifacts/ws/bigtop-tests/test-artifacts/hadoop/target/hadoop-smoke-0.8.0-SNAPSHOT.jar>
to org.apache.bigtop.itest/hadoop-smoke/0.8.0-20140906.023602-84/hadoop-smoke-0.8.0-20140906.023602-84.jar
Sending artifact delta relative to Bigtop-trunk-testartifacts ? hadoopsmoke #1490
Archived 2 artifacts
Archive block size is 32768
Received 2 blocks and 257828 bytes
Compression is 20.3%
Took 0.24 sec
[JENKINS] Archiving <https://builds.apache.org/job/Bigtop-trunk-testartifacts/ws/bigtop-tests/test-artifacts/oozie/pom.xml>
to org.apache.bigtop.itest/oozie-smoke/0.8.0-SNAPSHOT/oozie-smoke-0.8.0-SNAPSHOT.pom
[JENKINS] Archiving <https://builds.apache.org/job/Bigtop-trunk-testartifacts/ws/bigtop-tests/test-artifacts/oozie/target/oozie-smoke-0.8.0-SNAPSHOT.jar>
to org.apache.bigtop.itest/oozie-smoke/0.8.0-20140906.023639-84/oozie-smoke-0.8.0-20140906.023639-84.jar
Sending artifact delta relative to Bigtop-trunk-testartifacts ? ooziesmoke #1490
Archived 2 artifacts
Archive block size is 32768
Received 0 blocks and 16606 bytes
Compression is 0.0%
Took 0.2 sec
[JENKINS] Archiving <https://builds.apache.org/job/Bigtop-trunk-testartifacts/ws/bigtop-tests/test-artifacts/giraph/pom.xml>
to org.apache.bigtop.itest/giraph-smoke/0.8.0-SNAPSHOT/giraph-smoke-0.8.0-SNAPSHOT.pom
[JENKINS] Archiving <https://builds.apache.org/job/Bigtop-trunk-testartifacts/ws/bigtop-tests/test-artifacts/giraph/target/giraph-smoke-0.8.0-SNAPSHOT.jar>
to org.apache.bigtop.itest/giraph-smoke/0.8.0-20140906.023753-21/giraph-smoke-0.8.0-20140906.023753-21.jar
Sending artifact delta relative to Bigtop-trunk-testartifacts ? giraphsmoke #1422
Archived 2 artifacts
Archive block size is 32768
Received 0 blocks and 14473 bytes
Compression is 0.0%
Took 0.4 sec
[JENKINS] Archiving <https://builds.apache.org/job/Bigtop-trunk-testartifacts/ws/bigtop-tests/test-artifacts/hcatalog/pom.xml>
to org.apache.bigtop.itest/hcatalog-smoke/0.8.0-SNAPSHOT/hcatalog-smoke-0.8.0-SNAPSHOT.pom
Sending artifact delta relative to Bigtop-trunk-testartifacts ? hcatalogsmoke #1422
Archived 1 artifacts
Archive block size is 32768
Received 0 blocks and 1529 bytes
Compression is 0.0%
Took 0.16 sec
[JENKINS] Archiving <https://builds.apache.org/job/Bigtop-trunk-testartifacts/ws/bigtop-tests/test-artifacts/datafu/pom.xml>
to org.apache.bigtop.itest/datafu-smoke/0.8.0-SNAPSHOT/datafu-smoke-0.8.0-SNAPSHOT.pom
[JENKINS] Archiving <https://builds.apache.org/job/Bigtop-trunk-testartifacts/ws/bigtop-tests/test-artifacts/datafu/target/datafu-smoke-0.8.0-SNAPSHOT.jar>
to org.apache.bigtop.itest/datafu-smoke/0.8.0-20140906.023832-21/datafu-smoke-0.8.0-20140906.023832-21.jar
Sending artifact delta relative to Bigtop-trunk-testartifacts ? datafusmoke #1422
Archived 2 artifacts
Archive block size is 32768
Received 0 blocks and 71529 bytes
Compression is 0.0%
Took 0.15 sec
[JENKINS] Archiving <https://builds.apache.org/job/Bigtop-trunk-testartifacts/ws/bigtop-tests/test-artifacts/longevity/pom.xml>
to org.apache.bigtop.itest/io-longevity/0.8.0-SNAPSHOT/io-longevity-0.8.0-SNAPSHOT.pom
Sending artifact delta relative to Bigtop-trunk-testartifacts ? io-longevity #1422
Archived 1 artifacts
Archive block size is 32768
Received 0 blocks and 1699 bytes
Compression is 0.0%
Took 0.1 sec
[JENKINS] Archiving <https://builds.apache.org/job/Bigtop-trunk-testartifacts/ws/bigtop-tests/test-artifacts/mahout/pom.xml>
to org.apache.bigtop.itest/mahout-smoke/0.8.0-SNAPSHOT/mahout-smoke-0.8.0-SNAPSHOT.pom
[JENKINS] Archiving <https://builds.apache.org/job/Bigtop-trunk-testartifacts/ws/bigtop-tests/test-artifacts/mahout/target/mahout-smoke-0.8.0-SNAPSHOT.jar>
to org.apache.bigtop.itest/mahout-smoke/0.8.0-20140906.023745-21/mahout-smoke-0.8.0-20140906.023745-21.jar
Sending artifact delta relative to Bigtop-trunk-testartifacts ? mahoutsmoke #1422
Archived 2 artifacts
Archive block size is 32768
Received 0 blocks and 19973 bytes
Compression is 0.0%
Took 2.1 sec
[JENKINS] Archiving <https://builds.apache.org/job/Bigtop-trunk-testartifacts/ws/bigtop-tests/test-artifacts/solr/pom.xml>
to org.apache.bigtop.itest/solr-smoke/0.8.0-SNAPSHOT/solr-smoke-0.8.0-SNAPSHOT.pom
[JENKINS] Archiving <https://builds.apache.org/job/Bigtop-trunk-testartifacts/ws/bigtop-tests/test-artifacts/solr/target/solr-smoke-0.8.0-SNAPSHOT.jar>
to org.apache.bigtop.itest/solr-smoke/0.8.0-20140906.023808-21/solr-smoke-0.8.0-20140906.023808-21.jar
Sending artifact delta relative to Bigtop-trunk-testartifacts ? solrsmoke #1422
Archived 2 artifacts
Archive block size is 32768
Received 0 blocks and 30929 bytes
Compression is 0.0%
Took 0.14 sec
[JENKINS] Archiving <https://builds.apache.org/job/Bigtop-trunk-testartifacts/ws/bigtop-tests/test-artifacts/hbase/pom.xml>
to org.apache.bigtop.itest/hbase-smoke/0.8.0-SNAPSHOT/hbase-smoke-0.8.0-SNAPSHOT.pom
[JENKINS] Archiving <https://builds.apache.org/job/Bigtop-trunk-testartifacts/ws/bigtop-tests/test-artifacts/hbase/target/hbase-smoke-0.8.0-SNAPSHOT.jar>
to org.apache.bigtop.itest/hbase-smoke/0.8.0-20140906.023709-21/hbase-smoke-0.8.0-20140906.023709-21.jar
Sending artifact delta relative to Bigtop-trunk-testartifacts ? hbasesmoke #1422
Archived 2 artifacts
Archive block size is 32768
Received 1 blocks and 152170 bytes
Compression is 17.7%
Took 0.18 sec
[JENKINS] Archiving <https://builds.apache.org/job/Bigtop-trunk-testartifacts/ws/bigtop-tests/test-artifacts/phoenix/pom.xml>
to org.apache.bigtop.itest/phoenix-smoke/0.8.0-SNAPSHOT/phoenix-smoke-0.8.0-SNAPSHOT.pom
Sending artifact delta relative to Bigtop-trunk-testartifacts ? phoenixsmoke #1422
Archived 1 artifacts
Archive block size is 32768
Received 0 blocks and 1526 bytes
Compression is 0.0%
Took 2.1 sec
[JENKINS] Archiving <https://builds.apache.org/job/Bigtop-trunk-testartifacts/ws/bigtop-tests/test-artifacts/fatjar/pom.xml>
to org.apache.bigtop.itest/fat-smoke/0.8.0-SNAPSHOT/fat-smoke-0.8.0-SNAPSHOT.pom
[JENKINS] Archiving <https://builds.apache.org/job/Bigtop-trunk-testartifacts/ws/bigtop-tests/test-artifacts/fatjar/target/fat-smoke-0.8.0-SNAPSHOT.jar>
to org.apache.bigtop.itest/fat-smoke/0.8.0-SNAPSHOT/fat-smoke-0.8.0-SNAPSHOT.jar
Sending artifact delta relative to Bigtop-trunk-testartifacts ? fatjar #1422
Archived 2 artifacts
Archive block size is 32768
Received 0 blocks and 16192 bytes
Compression is 0.0%
Took 3.2 sec
Sending e-mails to: ci@bigtop.apache.org
Sending e-mails to: ci@bigtop.apache.org
channel stopped

Mime
View raw message