bigtop-ci mailing list archives

Site index · List index
Message view « Date » · « Thread »
Top « Date » · « Thread »
From Apache Jenkins Server <jenk...@builds.apache.org>
Subject Build failed in Jenkins: Bigtop-trunk-testartifacts #1503
Date Tue, 09 Sep 2014 16:22:24 GMT
See <https://builds.apache.org/job/Bigtop-trunk-testartifacts/1503/changes>

Changes:

[cos] BIGTOP-1444. Phoenix RPM build is broken after BIGTOP-1421

------------------------------------------
[...truncated 25 lines...]
log4j:WARN Please initialize the log4j system properly.
Executing Maven:  -B -f <https://builds.apache.org/job/Bigtop-trunk-testartifacts/ws/bigtop-tests/test-artifacts/pom.xml>
-Dmaven.repo.local=/home/jenkins/jenkins-slave/maven-repositories/1 -U clean deploy
[INFO] Scanning for projects...
Downloading: http://repository.codehaus.org/org/codehaus/groovy/groovy-eclipse-batch/maven-metadata.xml
Downloading: http://nexus.codehaus.org/snapshots/org/codehaus/groovy/groovy-eclipse-batch/maven-metadata.xml
Downloading: http://repo.maven.apache.org/maven2/org/codehaus/groovy/groovy-eclipse-batch/maven-metadata.xml
Downloaded: http://repo.maven.apache.org/maven2/org/codehaus/groovy/groovy-eclipse-batch/maven-metadata.xml
(2 KB at 5.1 KB/sec)
Downloaded: http://repository.codehaus.org/org/codehaus/groovy/groovy-eclipse-batch/maven-metadata.xml
(2 KB at 4.0 KB/sec)
Downloaded: http://nexus.codehaus.org/snapshots/org/codehaus/groovy/groovy-eclipse-batch/maven-metadata.xml
(599 B at 1.4 KB/sec)
Downloading: http://repository.codehaus.org/org/codehaus/groovy/groovy-eclipse-batch/2.1.8-01-SNAPSHOT/maven-metadata.xml
Downloading: http://nexus.codehaus.org/snapshots/org/codehaus/groovy/groovy-eclipse-batch/2.1.8-01-SNAPSHOT/maven-metadata.xml
Downloaded: http://nexus.codehaus.org/snapshots/org/codehaus/groovy/groovy-eclipse-batch/2.1.8-01-SNAPSHOT/maven-metadata.xml
(798 B at 3.3 KB/sec)
Downloading: http://repository.codehaus.org/org/codehaus/groovy/groovy-eclipse-batch/2.2.1-01-SNAPSHOT/maven-metadata.xml
Downloading: http://nexus.codehaus.org/snapshots/org/codehaus/groovy/groovy-eclipse-batch/2.2.1-01-SNAPSHOT/maven-metadata.xml
Downloaded: http://nexus.codehaus.org/snapshots/org/codehaus/groovy/groovy-eclipse-batch/2.2.1-01-SNAPSHOT/maven-metadata.xml
(2 KB at 5.1 KB/sec)
Downloading: http://nexus.codehaus.org/snapshots/org/codehaus/groovy/groovy-eclipse-batch/2.3.0-01-SNAPSHOT/maven-metadata.xml
Downloading: http://repository.codehaus.org/org/codehaus/groovy/groovy-eclipse-batch/2.3.0-01-SNAPSHOT/maven-metadata.xml
Downloaded: http://nexus.codehaus.org/snapshots/org/codehaus/groovy/groovy-eclipse-batch/2.3.0-01-SNAPSHOT/maven-metadata.xml
(2 KB at 5.3 KB/sec)
Downloading: http://repository.codehaus.org/org/codehaus/groovy/groovy-eclipse-batch/2.3.1-01-SNAPSHOT/maven-metadata.xml
Downloading: http://nexus.codehaus.org/snapshots/org/codehaus/groovy/groovy-eclipse-batch/2.3.1-01-SNAPSHOT/maven-metadata.xml
Downloaded: http://nexus.codehaus.org/snapshots/org/codehaus/groovy/groovy-eclipse-batch/2.3.1-01-SNAPSHOT/maven-metadata.xml
(2 KB at 5.3 KB/sec)
Downloading: http://repository.codehaus.org/org/codehaus/groovy/groovy-eclipse-batch/2.3.2-01-SNAPSHOT/maven-metadata.xml
Downloading: http://nexus.codehaus.org/snapshots/org/codehaus/groovy/groovy-eclipse-batch/2.3.2-01-SNAPSHOT/maven-metadata.xml
Downloaded: http://nexus.codehaus.org/snapshots/org/codehaus/groovy/groovy-eclipse-batch/2.3.2-01-SNAPSHOT/maven-metadata.xml
(2 KB at 4.8 KB/sec)
Downloading: http://nexus.codehaus.org/snapshots/org/codehaus/groovy/groovy-eclipse-batch/2.3.3-01-SNAPSHOT/maven-metadata.xml
Downloading: http://repository.codehaus.org/org/codehaus/groovy/groovy-eclipse-batch/2.3.3-01-SNAPSHOT/maven-metadata.xml
Downloaded: http://nexus.codehaus.org/snapshots/org/codehaus/groovy/groovy-eclipse-batch/2.3.3-01-SNAPSHOT/maven-metadata.xml
(2 KB at 5.3 KB/sec)
Downloading: http://repository.codehaus.org/org/codehaus/groovy/groovy-eclipse-batch/2.3.4-01-SNAPSHOT/maven-metadata.xml
Downloading: http://nexus.codehaus.org/snapshots/org/codehaus/groovy/groovy-eclipse-batch/2.3.4-01-SNAPSHOT/maven-metadata.xml
Downloaded: http://nexus.codehaus.org/snapshots/org/codehaus/groovy/groovy-eclipse-batch/2.3.4-01-SNAPSHOT/maven-metadata.xml
(378 B at 1.6 KB/sec)
[INFO] ------------------------------------------------------------------------
[INFO] Reactor Build Order:
[INFO] 
[INFO] bigtop-smokes
[INFO] hadoopsmoke
[INFO] packagesmoke
[INFO] httpfssmokes
[INFO] ooziesmoke
[INFO] hivesmoke
[INFO] hbasesmoke
[INFO] flumesmoke
[INFO] sqoopsmokes
[INFO] mahoutsmoke
[INFO] giraphsmoke
[INFO] huesmoke
[INFO] solrsmoke
[INFO] crunchsmoke
[INFO] datafusmoke
[INFO] io-longevity
[INFO] hcatalogsmoke
[INFO] sparksmoke
[INFO] phoenixsmoke
[INFO] fatjar
[INFO]                                                                         
[INFO] ------------------------------------------------------------------------
[INFO] Building bigtop-smokes 0.9.0-SNAPSHOT
[INFO] ------------------------------------------------------------------------
Downloading: http://repo.maven.apache.org/maven2/org/apache/maven/plugins/maven-failsafe-plugin/2.7.1/maven-failsafe-plugin-2.7.1.pom
Downloaded: http://repo.maven.apache.org/maven2/org/apache/maven/plugins/maven-failsafe-plugin/2.7.1/maven-failsafe-plugin-2.7.1.pom
(12 KB at 146.9 KB/sec)
Downloading: http://repo.maven.apache.org/maven2/org/apache/maven/surefire/surefire/2.7.1/surefire-2.7.1.pom
Downloaded: http://repo.maven.apache.org/maven2/org/apache/maven/surefire/surefire/2.7.1/surefire-2.7.1.pom
(10 KB at 78.5 KB/sec)
Downloading: http://repo.maven.apache.org/maven2/org/apache/maven/plugins/maven-failsafe-plugin/2.7.1/maven-failsafe-plugin-2.7.1.jar
Downloaded: http://repo.maven.apache.org/maven2/org/apache/maven/plugins/maven-failsafe-plugin/2.7.1/maven-failsafe-plugin-2.7.1.jar
(45 KB at 309.1 KB/sec)
Downloading: http://repository.apache.org/snapshots/org/apache/bigtop/itest/itest-common/0.9.0-SNAPSHOT/maven-metadata.xml
[WARNING] Could not transfer metadata org.apache.bigtop.itest:itest-common:0.9.0-SNAPSHOT/maven-metadata.xml
from/to Nexus (http://repository.apache.org/snapshots): Failed to transfer file: http://repository.apache.org/snapshots/org/apache/bigtop/itest/itest-common/0.9.0-SNAPSHOT/maven-metadata.xml.
Return code is: 503, ReasonPhrase:Service Temporarily Unavailable.
[WARNING] Failure to transfer org.apache.bigtop.itest:itest-common:0.9.0-SNAPSHOT/maven-metadata.xml
from http://repository.apache.org/snapshots was cached in the local repository, resolution
will not be reattempted until the update interval of Nexus has elapsed or updates are forced.
Original error: Could not transfer metadata org.apache.bigtop.itest:itest-common:0.9.0-SNAPSHOT/maven-metadata.xml
from/to Nexus (http://repository.apache.org/snapshots): Failed to transfer file: http://repository.apache.org/snapshots/org/apache/bigtop/itest/itest-common/0.9.0-SNAPSHOT/maven-metadata.xml.
Return code is: 503, ReasonPhrase:Service Temporarily Unavailable.
Downloading: http://repository.apache.org/snapshots/org/apache/bigtop/bigtop/0.9.0-SNAPSHOT/maven-metadata.xml
[WARNING] Could not transfer metadata org.apache.bigtop:bigtop:0.9.0-SNAPSHOT/maven-metadata.xml
from/to Nexus (http://repository.apache.org/snapshots): Failed to transfer file: http://repository.apache.org/snapshots/org/apache/bigtop/bigtop/0.9.0-SNAPSHOT/maven-metadata.xml.
Return code is: 503, ReasonPhrase:Service Temporarily Unavailable.
Downloading: http://repository.apache.org/snapshots/org/apache/bigtop/bigtop/0.9.0-SNAPSHOT/bigtop-0.9.0-SNAPSHOT.pom
[INFO] ------------------------------------------------------------------------
[INFO] Reactor Summary:
[INFO] 
[INFO] bigtop-smokes ..................................... FAILURE [1:01.296s]
[INFO] hadoopsmoke ....................................... SKIPPED
[INFO] packagesmoke ...................................... SKIPPED
[INFO] httpfssmokes ...................................... SKIPPED
[INFO] ooziesmoke ........................................ SKIPPED
[INFO] hivesmoke ......................................... SKIPPED
[INFO] hbasesmoke ........................................ SKIPPED
[INFO] flumesmoke ........................................ SKIPPED
[INFO] sqoopsmokes ....................................... SKIPPED
[INFO] mahoutsmoke ....................................... SKIPPED
[INFO] giraphsmoke ....................................... SKIPPED
[INFO] huesmoke .......................................... SKIPPED
[INFO] solrsmoke ......................................... SKIPPED
[INFO] crunchsmoke ....................................... SKIPPED
[INFO] datafusmoke ....................................... SKIPPED
[INFO] io-longevity ...................................... SKIPPED
[INFO] hcatalogsmoke ..................................... SKIPPED
[INFO] sparksmoke ........................................ SKIPPED
[INFO] phoenixsmoke ...................................... SKIPPED
[INFO] fatjar ............................................ SKIPPED
[INFO] ------------------------------------------------------------------------
[INFO] BUILD FAILURE
[INFO] ------------------------------------------------------------------------
[INFO] Total time: 1:32.414s
[INFO] Finished at: Tue Sep 09 16:20:59 UTC 2014
[INFO] Final Memory: 10M/72M
[INFO] ------------------------------------------------------------------------
Waiting for Jenkins to finish collecting data[ERROR] Failed to execute goal on project bigtop-smokes:
Could not resolve dependencies for project org.apache.bigtop.itest:bigtop-smokes:pom:0.9.0-SNAPSHOT:
Failed to collect dependencies for [org.apache.bigtop.itest:itest-common:jar:0.9.0-SNAPSHOT
(compile)]: Failed to read artifact descriptor for org.apache.bigtop.itest:itest-common:jar:0.9.0-SNAPSHOT:
Could not transfer artifact org.apache.bigtop:bigtop:pom:0.9.0-SNAPSHOT from/to Nexus (http://repository.apache.org/snapshots):
Failed to transfer file: http://repository.apache.org/snapshots/org/apache/bigtop/bigtop/0.9.0-SNAPSHOT/bigtop-0.9.0-SNAPSHOT.pom.
Return code is: 503, ReasonPhrase:Service Temporarily Unavailable. -> [Help 1]
[ERROR] 
[ERROR] To see the full stack trace of the errors, re-run Maven with the -e switch.
[ERROR] Re-run Maven using the -X switch to enable full debug logging.
[ERROR] 
[ERROR] For more information about the errors and possible solutions, please read the following
articles:
[ERROR] [Help 1] http://cwiki.apache.org/confluence/display/MAVEN/DependencyResolutionException

[JENKINS] Archiving <https://builds.apache.org/job/Bigtop-trunk-testartifacts/ws/bigtop-tests/test-artifacts/pom.xml>
to org.apache.bigtop.itest/bigtop-smokes/0.9.0-SNAPSHOT/bigtop-smokes-0.9.0-SNAPSHOT.pom
Sending artifact delta relative to Bigtop-trunk-testartifacts ? bigtop-smokes #1501
Archived 1 artifacts
Archive block size is 32768
Received 0 blocks and 4920 bytes
Compression is 0.0%
Took 82 ms
[JENKINS] Archiving <https://builds.apache.org/job/Bigtop-trunk-testartifacts/ws/bigtop-tests/test-artifacts/sqoop/pom.xml>
to org.apache.bigtop.itest/sqoop-smoke/0.9.0-SNAPSHOT/sqoop-smoke-0.9.0-SNAPSHOT.pom
Sending artifact delta relative to Bigtop-trunk-testartifacts ? sqoopsmokes #1501
Archived 1 artifacts
Archive block size is 32768
Received 0 blocks and 1837 bytes
Compression is 0.0%
Took 74 ms
[JENKINS] Archiving <https://builds.apache.org/job/Bigtop-trunk-testartifacts/ws/bigtop-tests/test-artifacts/hue/pom.xml>
to org.apache.bigtop.itest/hue-smoke/0.9.0-SNAPSHOT/hue-smoke-0.9.0-SNAPSHOT.pom
Sending artifact delta relative to Bigtop-trunk-testartifacts ? huesmoke #1501
Archived 1 artifacts
Archive block size is 32768
Received 0 blocks and 1510 bytes
Compression is 0.0%
Took 98 ms
[JENKINS] Archiving <https://builds.apache.org/job/Bigtop-trunk-testartifacts/ws/bigtop-tests/test-artifacts/crunch/pom.xml>
to org.apache.bigtop.itest/crunch-smoke/0.9.0-SNAPSHOT/crunch-smoke-0.9.0-SNAPSHOT.pom
Sending artifact delta relative to Bigtop-trunk-testartifacts ? crunchsmoke #1501
Archived 1 artifacts
Archive block size is 32768
Received 0 blocks and 1521 bytes
Compression is 0.0%
Took 74 ms
[JENKINS] Archiving <https://builds.apache.org/job/Bigtop-trunk-testartifacts/ws/bigtop-tests/test-artifacts/package/pom.xml>
to org.apache.bigtop.itest/package-smoke/0.9.0-SNAPSHOT/package-smoke-0.9.0-SNAPSHOT.pom
Sending artifact delta relative to Bigtop-trunk-testartifacts ? packagesmoke #1501
Archived 1 artifacts
Archive block size is 32768
Received 0 blocks and 2836 bytes
Compression is 0.0%
Took 1.9 sec
[JENKINS] Archiving <https://builds.apache.org/job/Bigtop-trunk-testartifacts/ws/bigtop-tests/test-artifacts/hive/pom.xml>
to org.apache.bigtop.itest/hive-smoke/0.9.0-SNAPSHOT/hive-smoke-0.9.0-SNAPSHOT.pom
Sending artifact delta relative to Bigtop-trunk-testartifacts ? hivesmoke #1501
Archived 1 artifacts
Archive block size is 32768
Received 0 blocks and 1513 bytes
Compression is 0.0%
Took 0.17 sec
[JENKINS] Archiving <https://builds.apache.org/job/Bigtop-trunk-testartifacts/ws/bigtop-tests/test-artifacts/flume/pom.xml>
to org.apache.bigtop.itest/flume-smoke/0.9.0-SNAPSHOT/flume-smoke-0.9.0-SNAPSHOT.pom
Sending artifact delta relative to Bigtop-trunk-testartifacts ? flumesmoke #1501
Archived 1 artifacts
Archive block size is 32768
Received 0 blocks and 1677 bytes
Compression is 0.0%
Took 0.14 sec
[JENKINS] Archiving <https://builds.apache.org/job/Bigtop-trunk-testartifacts/ws/bigtop-tests/test-artifacts/httpfs/pom.xml>
to org.apache.bigtop.itest/httpfs-smoke/0.9.0-SNAPSHOT/httpfs-smoke-0.9.0-SNAPSHOT.pom
Sending artifact delta relative to Bigtop-trunk-testartifacts ? httpfssmokes #1501
Archived 1 artifacts
Archive block size is 32768
Received 0 blocks and 1541 bytes
Compression is 0.0%
Took 0.11 sec
[JENKINS] Archiving <https://builds.apache.org/job/Bigtop-trunk-testartifacts/ws/bigtop-tests/test-artifacts/spark/pom.xml>
to org.apache.bigtop.itest/spark-smoke/0.9.0-SNAPSHOT/spark-smoke-0.9.0-SNAPSHOT.pom
Sending artifact delta relative to Bigtop-trunk-testartifacts ? sparksmoke #1501
Archived 1 artifacts
Archive block size is 32768
Received 0 blocks and 2266 bytes
Compression is 0.0%
Took 74 ms
[JENKINS] Archiving <https://builds.apache.org/job/Bigtop-trunk-testartifacts/ws/bigtop-tests/test-artifacts/hadoop/pom.xml>
to org.apache.bigtop.itest/hadoop-smoke/0.9.0-SNAPSHOT/hadoop-smoke-0.9.0-SNAPSHOT.pom
Sending artifact delta relative to Bigtop-trunk-testartifacts ? hadoopsmoke #1501
Archived 1 artifacts
Archive block size is 32768
Received 0 blocks and 1953 bytes
Compression is 0.0%
Took 1.9 sec
[JENKINS] Archiving <https://builds.apache.org/job/Bigtop-trunk-testartifacts/ws/bigtop-tests/test-artifacts/oozie/pom.xml>
to org.apache.bigtop.itest/oozie-smoke/0.9.0-SNAPSHOT/oozie-smoke-0.9.0-SNAPSHOT.pom
Sending artifact delta relative to Bigtop-trunk-testartifacts ? ooziesmoke #1501
Archived 1 artifacts
Archive block size is 32768
Received 0 blocks and 1677 bytes
Compression is 0.0%
Took 0.16 sec
[JENKINS] Archiving <https://builds.apache.org/job/Bigtop-trunk-testartifacts/ws/bigtop-tests/test-artifacts/giraph/pom.xml>
to org.apache.bigtop.itest/giraph-smoke/0.9.0-SNAPSHOT/giraph-smoke-0.9.0-SNAPSHOT.pom
Sending artifact delta relative to Bigtop-trunk-testartifacts ? giraphsmoke #1501
Archived 1 artifacts
Archive block size is 32768
Received 0 blocks and 1522 bytes
Compression is 0.0%
Took 0.13 sec
[JENKINS] Archiving <https://builds.apache.org/job/Bigtop-trunk-testartifacts/ws/bigtop-tests/test-artifacts/hcatalog/pom.xml>
to org.apache.bigtop.itest/hcatalog-smoke/0.9.0-SNAPSHOT/hcatalog-smoke-0.9.0-SNAPSHOT.pom
Sending artifact delta relative to Bigtop-trunk-testartifacts ? hcatalogsmoke #1501
Archived 1 artifacts
Archive block size is 32768
Received 0 blocks and 1529 bytes
Compression is 0.0%
Took 0.12 sec
[JENKINS] Archiving <https://builds.apache.org/job/Bigtop-trunk-testartifacts/ws/bigtop-tests/test-artifacts/datafu/pom.xml>
to org.apache.bigtop.itest/datafu-smoke/0.9.0-SNAPSHOT/datafu-smoke-0.9.0-SNAPSHOT.pom
Sending artifact delta relative to Bigtop-trunk-testartifacts ? datafusmoke #1501
Archived 1 artifacts
Archive block size is 32768
Received 0 blocks and 2405 bytes
Compression is 0.0%
Took 0.18 sec
[JENKINS] Archiving <https://builds.apache.org/job/Bigtop-trunk-testartifacts/ws/bigtop-tests/test-artifacts/longevity/pom.xml>
to org.apache.bigtop.itest/io-longevity/0.9.0-SNAPSHOT/io-longevity-0.9.0-SNAPSHOT.pom
Sending artifact delta relative to Bigtop-trunk-testartifacts ? io-longevity #1501
Archived 1 artifacts
Archive block size is 32768
Received 0 blocks and 1699 bytes
Compression is 0.0%
Took 0.17 sec
[JENKINS] Archiving <https://builds.apache.org/job/Bigtop-trunk-testartifacts/ws/bigtop-tests/test-artifacts/mahout/pom.xml>
to org.apache.bigtop.itest/mahout-smoke/0.9.0-SNAPSHOT/mahout-smoke-0.9.0-SNAPSHOT.pom
Sending artifact delta relative to Bigtop-trunk-testartifacts ? mahoutsmoke #1501
Archived 1 artifacts
Archive block size is 32768
Received 0 blocks and 1522 bytes
Compression is 0.0%
Took 0.14 sec
[JENKINS] Archiving <https://builds.apache.org/job/Bigtop-trunk-testartifacts/ws/bigtop-tests/test-artifacts/solr/pom.xml>
to org.apache.bigtop.itest/solr-smoke/0.9.0-SNAPSHOT/solr-smoke-0.9.0-SNAPSHOT.pom
Sending artifact delta relative to Bigtop-trunk-testartifacts ? solrsmoke #1501
Archived 1 artifacts
Archive block size is 32768
Received 0 blocks and 1784 bytes
Compression is 0.0%
Took 0.1 sec
[JENKINS] Archiving <https://builds.apache.org/job/Bigtop-trunk-testartifacts/ws/bigtop-tests/test-artifacts/hbase/pom.xml>
to org.apache.bigtop.itest/hbase-smoke/0.9.0-SNAPSHOT/hbase-smoke-0.9.0-SNAPSHOT.pom
Sending artifact delta relative to Bigtop-trunk-testartifacts ? hbasesmoke #1501
Archived 1 artifacts
Archive block size is 32768
Received 0 blocks and 2339 bytes
Compression is 0.0%
Took 0.1 sec
[JENKINS] Archiving <https://builds.apache.org/job/Bigtop-trunk-testartifacts/ws/bigtop-tests/test-artifacts/phoenix/pom.xml>
to org.apache.bigtop.itest/phoenix-smoke/0.9.0-SNAPSHOT/phoenix-smoke-0.9.0-SNAPSHOT.pom
Sending artifact delta relative to Bigtop-trunk-testartifacts ? phoenixsmoke #1501
Archived 1 artifacts
Archive block size is 32768
Received 0 blocks and 1526 bytes
Compression is 0.0%
Took 0.17 sec
[JENKINS] Archiving <https://builds.apache.org/job/Bigtop-trunk-testartifacts/ws/bigtop-tests/test-artifacts/fatjar/pom.xml>
to org.apache.bigtop.itest/fat-smoke/0.9.0-SNAPSHOT/fat-smoke-0.9.0-SNAPSHOT.pom
Sending artifact delta relative to Bigtop-trunk-testartifacts ? fatjar #1501
Archived 1 artifacts
Archive block size is 32768
Received 0 blocks and 5446 bytes
Compression is 0.0%
Took 3.9 sec
Sending e-mails to: ci@bigtop.apache.org
channel stopped

Mime
View raw message