bigtop-ci mailing list archives

Site index · List index
Message view « Date » · « Thread »
Top « Date » · « Thread »
From Apache Jenkins Server <jenk...@builds.apache.org>
Subject Build failed in Jenkins: Bigtop-trunk-test-execution #1315
Date Tue, 26 Aug 2014 17:39:24 GMT
See <https://builds.apache.org/job/Bigtop-trunk-test-execution/1315/changes>

Changes:

[rvs] BIGTOP-1169. Hue rpm build fails

------------------------------------------
Started by an SCM change
Building remotely on ubuntu3 (Ubuntu ubuntu) in workspace <https://builds.apache.org/job/Bigtop-trunk-test-execution/ws/>
Cloning the remote Git repository
Cloning repository https://git-wip-us.apache.org/repos/asf/bigtop.git
 > git init <https://builds.apache.org/job/Bigtop-trunk-test-execution/ws/>
Fetching upstream changes from https://git-wip-us.apache.org/repos/asf/bigtop.git
 > git --version
 > git fetch --tags --progress https://git-wip-us.apache.org/repos/asf/bigtop.git +refs/heads/*:refs/remotes/origin/*
 > git config remote.origin.url https://git-wip-us.apache.org/repos/asf/bigtop.git
 > git config remote.origin.fetch +refs/heads/*:refs/remotes/origin/*
 > git config remote.origin.url https://git-wip-us.apache.org/repos/asf/bigtop.git
Fetching upstream changes from https://git-wip-us.apache.org/repos/asf/bigtop.git
 > git fetch --tags --progress https://git-wip-us.apache.org/repos/asf/bigtop.git +refs/heads/*:refs/remotes/origin/*
 > git rev-parse origin/master^{commit}
Checking out Revision 77fdb7b4cc0ce3cc92943a5c1129ff8f798b6cae (origin/master)
 > git config core.sparsecheckout
 > git checkout -f 77fdb7b4cc0ce3cc92943a5c1129ff8f798b6cae
 > git rev-list da224ef2507a229716e1fd97d310cc66a68bad71
[Bigtop-trunk-test-execution] $ /bin/bash -xe /tmp/hudson1446781397311525534.sh
+ export HADOOP_CONF_DIR=
+ HADOOP_CONF_DIR=
+ export HADOOP_HOME=
+ HADOOP_HOME=
+ /home/hudson/tools/maven/latest3/bin/mvn -f bigtop-tests/test-execution/pom.xml -DskipTests
-DskipITs deploy -DrepositoryId=apache.snapshots.https
[INFO] Scanning for projects...
[INFO] ------------------------------------------------------------------------
[INFO] Reactor Build Order:
[INFO] 
[INFO] stacks-validation-common
[INFO] smoke-tests-conf
[INFO] packagesmokes
[INFO] bigtop-smokes
[INFO] 
[INFO] Using the builder org.apache.maven.lifecycle.internal.builder.singlethreaded.SingleThreadedBuilder
with a thread count of 1
[INFO]                                                                         
[INFO] ------------------------------------------------------------------------
[INFO] Building stacks-validation-common 0.8.0-SNAPSHOT
[INFO] ------------------------------------------------------------------------
[INFO] 
[INFO] --- maven-remote-resources-plugin:1.1:process (default) @ stacks-common ---
[INFO] Setting property: classpath.resource.loader.class => 'org.codehaus.plexus.velocity.ContextClassLoaderResourceLoader'.
[INFO] Setting property: velocimacro.messages.on => 'false'.
[INFO] Setting property: resource.loader => 'classpath'.
[INFO] Setting property: resource.manager.logwhenfound => 'false'.
[INFO] 
[INFO] --- maven-install-plugin:2.3:install (default-install) @ stacks-common ---
[INFO] Installing /x1/jenkins/jenkins-slave/workspace/Bigtop-trunk-test-execution/bigtop-tests/test-execution/common/pom.xml
to /home/jenkins/.m2/repository/org/apache/bigtop/itest/stacks-common/0.8.0-SNAPSHOT/stacks-common-0.8.0-SNAPSHOT.pom
[INFO] 
[INFO] --- maven-deploy-plugin:2.5:deploy (default-deploy) @ stacks-common ---
Downloading: https://repository.apache.org/content/repositories/snapshots/org/apache/bigtop/itest/stacks-common/0.8.0-SNAPSHOT/maven-metadata.xml
617/617 B   
            
Downloaded: https://repository.apache.org/content/repositories/snapshots/org/apache/bigtop/itest/stacks-common/0.8.0-SNAPSHOT/maven-metadata.xml
(617 B at 0.0 KB/sec)
Uploading: https://repository.apache.org/content/repositories/snapshots/org/apache/bigtop/itest/stacks-common/0.8.0-SNAPSHOT/stacks-common-0.8.0-20140826.173249-119.pom
2/12 KB     
4/12 KB   
6/12 KB   
8/12 KB   
10/12 KB   
12/12 KB   
           
Uploaded: https://repository.apache.org/content/repositories/snapshots/org/apache/bigtop/itest/stacks-common/0.8.0-SNAPSHOT/stacks-common-0.8.0-20140826.173249-119.pom
(12 KB at 0.6 KB/sec)
Downloading: https://repository.apache.org/content/repositories/snapshots/org/apache/bigtop/itest/stacks-common/maven-metadata.xml
407/407 B   
[WARNING] Checksum validation failed, could not read expected checksum: Failed to transfer
file: https://repository.apache.org/content/repositories/snapshots/org/apache/bigtop/itest/stacks-common/maven-metadata.xml.sha1.
Return code is: 502 , ReasonPhrase:Proxy Error. for https://repository.apache.org/content/repositories/snapshots/org/apache/bigtop/itest/stacks-common/maven-metadata.xml
407/407 B   
            
Downloaded: https://repository.apache.org/content/repositories/snapshots/org/apache/bigtop/itest/stacks-common/maven-metadata.xml
(407 B at 0.0 KB/sec)
Uploading: https://repository.apache.org/content/repositories/snapshots/org/apache/bigtop/itest/stacks-common/0.8.0-SNAPSHOT/maven-metadata.xml
617/617 B   
            
Uploaded: https://repository.apache.org/content/repositories/snapshots/org/apache/bigtop/itest/stacks-common/0.8.0-SNAPSHOT/maven-metadata.xml
(617 B at 0.0 KB/sec)
Uploading: https://repository.apache.org/content/repositories/snapshots/org/apache/bigtop/itest/stacks-common/maven-metadata.xml
407/407 B   
            
Uploaded: https://repository.apache.org/content/repositories/snapshots/org/apache/bigtop/itest/stacks-common/maven-metadata.xml
(407 B at 0.2 KB/sec)
[INFO]                                                                         
[INFO] ------------------------------------------------------------------------
[INFO] Building smoke-tests-conf 0.8.0-SNAPSHOT
[INFO] ------------------------------------------------------------------------
[INFO] 
[INFO] --- maven-remote-resources-plugin:1.1:process (default) @ smoke-tests-conf ---
[INFO] 
[INFO] --- maven-resources-plugin:2.4:resources (default-resources) @ smoke-tests-conf ---
[INFO] Using 'UTF-8' encoding to copy filtered resources.
[INFO] Copying 1 resource
[INFO] Copying 3 resources
[INFO] 
[INFO] --- maven-compiler-plugin:2.0.2:compile (default-compile) @ smoke-tests-conf ---
[INFO] No sources to compile
[INFO] 
[INFO] --- maven-resources-plugin:2.4:testResources (default-testResources) @ smoke-tests-conf
---
[INFO] Using 'UTF-8' encoding to copy filtered resources.
[INFO] skip non existing resourceDirectory /x1/jenkins/jenkins-slave/workspace/Bigtop-trunk-test-execution/bigtop-tests/test-execution/conf/src/test/resources
[INFO] Copying 3 resources
[INFO] 
[INFO] --- maven-compiler-plugin:2.0.2:testCompile (default-testCompile) @ smoke-tests-conf
---
[INFO] No sources to compile
[INFO] 
[INFO] --- maven-surefire-plugin:2.11:test (default-test) @ smoke-tests-conf ---
[INFO] Tests are skipped.
[INFO] 
[INFO] --- maven-jar-plugin:2.3:jar (default-jar) @ smoke-tests-conf ---
[INFO] Building jar: /x1/jenkins/jenkins-slave/workspace/Bigtop-trunk-test-execution/bigtop-tests/test-execution/conf/target/smoke-tests-conf-0.8.0-SNAPSHOT.jar
[INFO] 
[INFO] --- maven-install-plugin:2.3:install (default-install) @ smoke-tests-conf ---
[INFO] Installing /x1/jenkins/jenkins-slave/workspace/Bigtop-trunk-test-execution/bigtop-tests/test-execution/conf/target/smoke-tests-conf-0.8.0-SNAPSHOT.jar
to /home/jenkins/.m2/repository/org/apache/bigtop/itest/smoke-tests-conf/0.8.0-SNAPSHOT/smoke-tests-conf-0.8.0-SNAPSHOT.jar
[INFO] Installing /x1/jenkins/jenkins-slave/workspace/Bigtop-trunk-test-execution/bigtop-tests/test-execution/conf/pom.xml
to /home/jenkins/.m2/repository/org/apache/bigtop/itest/smoke-tests-conf/0.8.0-SNAPSHOT/smoke-tests-conf-0.8.0-SNAPSHOT.pom
[INFO] 
[INFO] --- maven-deploy-plugin:2.5:deploy (default-deploy) @ smoke-tests-conf ---
Downloading: https://repository.apache.org/content/repositories/snapshots/org/apache/bigtop/itest/smoke-tests-conf/0.8.0-SNAPSHOT/maven-metadata.xml
795/795 B   
            
Downloaded: https://repository.apache.org/content/repositories/snapshots/org/apache/bigtop/itest/smoke-tests-conf/0.8.0-SNAPSHOT/maven-metadata.xml
(795 B at 0.0 KB/sec)
Uploading: https://repository.apache.org/content/repositories/snapshots/org/apache/bigtop/itest/smoke-tests-conf/0.8.0-SNAPSHOT/smoke-tests-conf-0.8.0-20140826.173603-119.jar
2/8 KB      
4/8 KB   
6/8 KB   
8/8 KB   
[WARNING] Failed to upload SHA-1 checksum for /x1/jenkins/jenkins-slave/workspace/Bigtop-trunk-test-execution/bigtop-tests/test-execution/conf/target/smoke-tests-conf-0.8.0-SNAPSHOT.jar:
Failed to transfer file: https://repository.apache.org/content/repositories/snapshots/org/apache/bigtop/itest/smoke-tests-conf/0.8.0-SNAPSHOT/smoke-tests-conf-0.8.0-20140826.173603-119.jar.sha1.
Return code is: 502, ReasonPhrase: Proxy Error.
[WARNING] Failed to upload MD5 checksum for /x1/jenkins/jenkins-slave/workspace/Bigtop-trunk-test-execution/bigtop-tests/test-execution/conf/target/smoke-tests-conf-0.8.0-SNAPSHOT.jar:
Failed to transfer file: https://repository.apache.org/content/repositories/snapshots/org/apache/bigtop/itest/smoke-tests-conf/0.8.0-SNAPSHOT/smoke-tests-conf-0.8.0-20140826.173603-119.jar.md5.
Return code is: 502, ReasonPhrase: Proxy Error.
         
Uploaded: https://repository.apache.org/content/repositories/snapshots/org/apache/bigtop/itest/smoke-tests-conf/0.8.0-SNAPSHOT/smoke-tests-conf-0.8.0-20140826.173603-119.jar
(8 KB at 0.1 KB/sec)
Uploading: https://repository.apache.org/content/repositories/snapshots/org/apache/bigtop/itest/smoke-tests-conf/0.8.0-SNAPSHOT/smoke-tests-conf-0.8.0-20140826.173603-119.pom
2/2 KB   
         
[INFO] ------------------------------------------------------------------------
[INFO] Reactor Summary:
[INFO] 
[INFO] stacks-validation-common .......................... SUCCESS [03:01 min]
[INFO] smoke-tests-conf .................................. FAILURE [03:46 min]
[INFO] packagesmokes ..................................... SKIPPED
[INFO] bigtop-smokes ..................................... SKIPPED
[INFO] ------------------------------------------------------------------------
[INFO] BUILD FAILURE
[INFO] ------------------------------------------------------------------------
[INFO] Total time: 06:47 min
[INFO] Finished at: 2014-08-26T17:39:19+00:00
[INFO] Final Memory: 10M/73M
[INFO] ------------------------------------------------------------------------
[ERROR] Failed to execute goal org.apache.maven.plugins:maven-deploy-plugin:2.5:deploy (default-deploy)
on project smoke-tests-conf: Failed to deploy artifacts: Could not transfer artifact org.apache.bigtop.itest:smoke-tests-conf:pom:0.8.0-20140826.173603-119
from/to apache.snapshots.https (https://repository.apache.org/content/repositories/snapshots):
Failed to transfer file: https://repository.apache.org/content/repositories/snapshots/org/apache/bigtop/itest/smoke-tests-conf/0.8.0-SNAPSHOT/smoke-tests-conf-0.8.0-20140826.173603-119.pom.
Return code is: 502, ReasonPhrase: Proxy Error. -> [Help 1]
[ERROR] 
[ERROR] To see the full stack trace of the errors, re-run Maven with the -e switch.
[ERROR] Re-run Maven using the -X switch to enable full debug logging.
[ERROR] 
[ERROR] For more information about the errors and possible solutions, please read the following
articles:
[ERROR] [Help 1] http://cwiki.apache.org/confluence/display/MAVEN/MojoExecutionException
[ERROR] 
[ERROR] After correcting the problems, you can resume the build with the command
[ERROR]   mvn <goals> -rf :smoke-tests-conf
Build step 'Execute shell' marked build as failure

Mime
View raw message