bigtop-ci mailing list archives

Site index · List index
Message view « Date » · « Thread »
Top « Date » · « Thread »
From Apache Jenkins Server <jenk...@builds.apache.org>
Subject Build failed in Jenkins: Bigtop-trunk-testartifacts #1469
Date Sat, 02 Aug 2014 19:36:02 GMT
See <https://builds.apache.org/job/Bigtop-trunk-testartifacts/1469/changes>

Changes:

[jayunit100] BIGTOP-1391: improve README.md markdown formatting

------------------------------------------
[...truncated 466 lines...]
[INFO] Copying 3 resources
[INFO] 
[INFO] --- maven-compiler-plugin:3.1:compile (default-compile) @ hive-smoke ---
[INFO] Changes detected - recompiling the module!
[INFO] Using Groovy-Eclipse compiler to compile both Java and Groovy files
[INFO] 
[INFO] --- maven-resources-plugin:2.4.3:testResources (default-testResources) @ hive-smoke
---
[INFO] Using 'UTF-8' encoding to copy filtered resources.
[INFO] skip non existing resourceDirectory <https://builds.apache.org/job/Bigtop-trunk-testartifacts/ws/bigtop-tests/test-artifacts/hive/src/test/resources>
[INFO] Copying 3 resources
[INFO] 
[INFO] --- maven-compiler-plugin:3.1:testCompile (default-testCompile) @ hive-smoke ---
[INFO] No sources to compile
[INFO] 
[INFO] --- maven-surefire-plugin:2.7:test (default-test) @ hive-smoke ---
[INFO] Tests are skipped.
[INFO] 
[INFO] --- maven-jar-plugin:2.2:jar (default-jar) @ hive-smoke ---
[INFO] Building jar: <https://builds.apache.org/job/Bigtop-trunk-testartifacts/ws/bigtop-tests/test-artifacts/hive/target/hive-smoke-0.8.0-SNAPSHOT.jar>
[INFO] 
[INFO] --- maven-failsafe-plugin:2.7.1:integration-test (integration-test) @ hive-smoke ---
[INFO] No tests to run.
[JENKINS] Recording test results
[INFO] 
[INFO] --- maven-failsafe-plugin:2.7.1:verify (verify) @ hive-smoke ---
[INFO] No tests to run.
[INFO] 
[INFO] --- maven-install-plugin:2.3:install (default-install) @ hive-smoke ---
[INFO] Installing <https://builds.apache.org/job/Bigtop-trunk-testartifacts/ws/bigtop-tests/test-artifacts/hive/target/hive-smoke-0.8.0-SNAPSHOT.jar>
to /home/jenkins/jenkins-slave/maven-repositories/1/org/apache/bigtop/itest/hive-smoke/0.8.0-SNAPSHOT/hive-smoke-0.8.0-SNAPSHOT.jar
[INFO] Installing <https://builds.apache.org/job/Bigtop-trunk-testartifacts/ws/bigtop-tests/test-artifacts/hive/pom.xml>
to /home/jenkins/jenkins-slave/maven-repositories/1/org/apache/bigtop/itest/hive-smoke/0.8.0-SNAPSHOT/hive-smoke-0.8.0-SNAPSHOT.pom
[JENKINS] Recording test results
[INFO] 
[INFO] --- maven-deploy-plugin:2.5:deploy (default-deploy) @ hive-smoke ---
Downloading: https://repository.apache.org/content/repositories/snapshots/org/apache/bigtop/itest/hive-smoke/0.8.0-SNAPSHOT/maven-metadata.xml
Downloaded: https://repository.apache.org/content/repositories/snapshots/org/apache/bigtop/itest/hive-smoke/0.8.0-SNAPSHOT/maven-metadata.xml
(786 B at 1.0 KB/sec)
Uploading: https://repository.apache.org/content/repositories/snapshots/org/apache/bigtop/itest/hive-smoke/0.8.0-SNAPSHOT/hive-smoke-0.8.0-20140802.193627-64.jar
Uploaded: https://repository.apache.org/content/repositories/snapshots/org/apache/bigtop/itest/hive-smoke/0.8.0-SNAPSHOT/hive-smoke-0.8.0-20140802.193627-64.jar
(134 KB at 256.2 KB/sec)
Uploading: https://repository.apache.org/content/repositories/snapshots/org/apache/bigtop/itest/hive-smoke/0.8.0-SNAPSHOT/hive-smoke-0.8.0-20140802.193627-64.pom
Uploaded: https://repository.apache.org/content/repositories/snapshots/org/apache/bigtop/itest/hive-smoke/0.8.0-SNAPSHOT/hive-smoke-0.8.0-20140802.193627-64.pom
(2 KB at 8.6 KB/sec)
Downloading: https://repository.apache.org/content/repositories/snapshots/org/apache/bigtop/itest/hive-smoke/maven-metadata.xml
Downloaded: https://repository.apache.org/content/repositories/snapshots/org/apache/bigtop/itest/hive-smoke/maven-metadata.xml
(404 B at 3.6 KB/sec)
Uploading: https://repository.apache.org/content/repositories/snapshots/org/apache/bigtop/itest/hive-smoke/0.8.0-SNAPSHOT/maven-metadata.xml
Uploaded: https://repository.apache.org/content/repositories/snapshots/org/apache/bigtop/itest/hive-smoke/0.8.0-SNAPSHOT/maven-metadata.xml
(786 B at 1.3 KB/sec)
Uploading: https://repository.apache.org/content/repositories/snapshots/org/apache/bigtop/itest/hive-smoke/maven-metadata.xml
Uploaded: https://repository.apache.org/content/repositories/snapshots/org/apache/bigtop/itest/hive-smoke/maven-metadata.xml
(404 B at 1.0 KB/sec)
[INFO]                                                                         
[INFO] ------------------------------------------------------------------------
[INFO] Building hbasesmoke 0.8.0-SNAPSHOT
[INFO] ------------------------------------------------------------------------
Downloading: http://repo.maven.apache.org/maven2/org/apache/hbase/hbase-common/0.98.2/hbase-common-0.98.2.pom
[WARNING] The POM for org.apache.hbase:hbase-common:jar:0.98.2 is missing, no dependency information
available
Downloading: http://repo.maven.apache.org/maven2/org/apache/hbase/hbase-common/0.98.2/hbase-common-0.98.2.pom
[WARNING] The POM for org.apache.hbase:hbase-common:jar:tests:0.98.2 is missing, no dependency
information available
Downloading: http://repo.maven.apache.org/maven2/org/apache/hbase/hbase-server/0.98.2/hbase-server-0.98.2.pom
[WARNING] The POM for org.apache.hbase:hbase-server:jar:0.98.2 is missing, no dependency information
available
Downloading: http://repo.maven.apache.org/maven2/org/apache/hbase/hbase-server/0.98.2/hbase-server-0.98.2.pom
[WARNING] The POM for org.apache.hbase:hbase-server:jar:tests:0.98.2 is missing, no dependency
information available
Downloading: http://repo.maven.apache.org/maven2/org/apache/hbase/hbase-common/0.98.2/hbase-common-0.98.2.jar
Downloading: http://repo.maven.apache.org/maven2/org/apache/hbase/hbase-common/0.98.2/hbase-common-0.98.2-tests.jar
Downloading: http://repo.maven.apache.org/maven2/org/apache/hbase/hbase-server/0.98.2/hbase-server-0.98.2.jar
Downloading: http://repo.maven.apache.org/maven2/org/apache/hbase/hbase-server/0.98.2/hbase-server-0.98.2-tests.jar
[INFO] ------------------------------------------------------------------------
[INFO] Reactor Summary:
[INFO] 
[INFO] bigtop-smokes ..................................... SUCCESS [20.860s]
[INFO] hadoopsmoke ....................................... SUCCESS [14.730s]
[INFO] packagesmoke ...................................... SUCCESS [14.339s]
[INFO] httpfssmokes ...................................... SUCCESS [5.715s]
[INFO] ooziesmoke ........................................ SUCCESS [8.140s]
[INFO] hivesmoke ......................................... SUCCESS [6.279s]
[INFO] hbasesmoke ........................................ FAILURE [1.090s]
[INFO] flumesmoke ........................................ SKIPPED
[INFO] sqoopsmokes ....................................... SKIPPED
[INFO] mahoutsmoke ....................................... SKIPPED
[INFO] giraphsmoke ....................................... SKIPPED
[INFO] huesmoke .......................................... SKIPPED
[INFO] solrsmoke ......................................... SKIPPED
[INFO] crunchsmoke ....................................... SKIPPED
[INFO] datafusmoke ....................................... SKIPPED
[INFO] fatjar ............................................ SKIPPED
[INFO] io-longevity ...................................... SKIPPED
[INFO] hcatalogsmoke ..................................... SKIPPED
[INFO] sparksmoke ........................................ SKIPPED
[INFO] phoenixsmoke ...................................... SKIPPED
[INFO] ------------------------------------------------------------------------
[INFO] BUILD FAILURE
[INFO] ------------------------------------------------------------------------
[INFO] Total time: 1:19.415s
[INFO] Finished at: Sat Aug 02 19:36:33 UTC 2014
[INFO] Final Memory: 26M/187M
[INFO] ------------------------------------------------------------------------
Waiting for Jenkins to finish collecting data
[ERROR] Failed to execute goal on project hbase-smoke: Could not resolve dependencies for
project org.apache.bigtop.itest:hbase-smoke:jar:0.8.0-SNAPSHOT: The following artifacts could
not be resolved: org.apache.hbase:hbase-common:jar:0.98.2, org.apache.hbase:hbase-common:jar:tests:0.98.2,
org.apache.hbase:hbase-server:jar:0.98.2, org.apache.hbase:hbase-server:jar:tests:0.98.2:
Could not find artifact org.apache.hbase:hbase-common:jar:0.98.2 in central (http://repo.maven.apache.org/maven2)
-> [Help 1]
[ERROR] 
[ERROR] To see the full stack trace of the errors, re-run Maven with the -e switch.
[ERROR] Re-run Maven using the -X switch to enable full debug logging.
[ERROR] 
[ERROR] For more information about the errors and possible solutions, please read the following
articles:
[ERROR] [Help 1] http://cwiki.apache.org/confluence/display/MAVEN/DependencyResolutionException
[ERROR] 
[ERROR] After correcting the problems, you can resume the build with the command
[ERROR]   mvn <goals> -rf :hbase-smoke
[JENKINS] Archiving <https://builds.apache.org/job/Bigtop-trunk-testartifacts/ws/bigtop-tests/test-artifacts/pom.xml>
to org.apache.bigtop.itest/bigtop-smokes/0.8.0-SNAPSHOT/bigtop-smokes-0.8.0-SNAPSHOT.pom
Sending artifact delta relative to Bigtop-trunk-testartifacts ? bigtop-smokes #1468
Archived 1 artifacts
Archive block size is 32768
Received 0 blocks and 4920 bytes
Compression is 0.0%
Took 0.19 sec
[JENKINS] Archiving <https://builds.apache.org/job/Bigtop-trunk-testartifacts/ws/bigtop-tests/test-artifacts/sqoop/pom.xml>
to org.apache.bigtop.itest/sqoop-smoke/0.8.0-SNAPSHOT/sqoop-smoke-0.8.0-SNAPSHOT.pom
Sending artifact delta relative to Bigtop-trunk-testartifacts ? sqoopsmokes #1422
Archived 1 artifacts
Archive block size is 32768
Received 0 blocks and 1837 bytes
Compression is 0.0%
Took 2.5 sec
[JENKINS] Archiving <https://builds.apache.org/job/Bigtop-trunk-testartifacts/ws/bigtop-tests/test-artifacts/hue/pom.xml>
to org.apache.bigtop.itest/hue-smoke/0.8.0-SNAPSHOT/hue-smoke-0.8.0-SNAPSHOT.pom
Sending artifact delta relative to Bigtop-trunk-testartifacts ? huesmoke #1422
Archived 1 artifacts
Archive block size is 32768
Received 0 blocks and 1510 bytes
Compression is 0.0%
Took 0.17 sec
[JENKINS] Archiving <https://builds.apache.org/job/Bigtop-trunk-testartifacts/ws/bigtop-tests/test-artifacts/crunch/pom.xml>
to org.apache.bigtop.itest/crunch-smoke/0.8.0-SNAPSHOT/crunch-smoke-0.8.0-SNAPSHOT.pom
Sending artifact delta relative to Bigtop-trunk-testartifacts ? crunchsmoke #1422
Archived 1 artifacts
Archive block size is 32768
Received 0 blocks and 1521 bytes
Compression is 0.0%
Took 93 ms
[JENKINS] Archiving <https://builds.apache.org/job/Bigtop-trunk-testartifacts/ws/bigtop-tests/test-artifacts/package/pom.xml>
to org.apache.bigtop.itest/package-smoke/0.8.0-SNAPSHOT/package-smoke-0.8.0-SNAPSHOT.pom
[JENKINS] Archiving <https://builds.apache.org/job/Bigtop-trunk-testartifacts/ws/bigtop-tests/test-artifacts/package/target/package-smoke-0.8.0-SNAPSHOT.jar>
to org.apache.bigtop.itest/package-smoke/0.8.0-20140802.193606-64/package-smoke-0.8.0-20140802.193606-64.jar
Sending artifact delta relative to Bigtop-trunk-testartifacts ? packagesmoke #1468
Archived 2 artifacts
Archive block size is 32768
Received 2 blocks and 759105 bytes
Compression is 7.9%
Took 2.5 sec
[JENKINS] Archiving <https://builds.apache.org/job/Bigtop-trunk-testartifacts/ws/bigtop-tests/test-artifacts/hive/pom.xml>
to org.apache.bigtop.itest/hive-smoke/0.8.0-SNAPSHOT/hive-smoke-0.8.0-SNAPSHOT.pom
[JENKINS] Archiving <https://builds.apache.org/job/Bigtop-trunk-testartifacts/ws/bigtop-tests/test-artifacts/hive/target/hive-smoke-0.8.0-SNAPSHOT.jar>
to org.apache.bigtop.itest/hive-smoke/0.8.0-20140802.193627-64/hive-smoke-0.8.0-20140802.193627-64.jar
Sending artifact delta relative to Bigtop-trunk-testartifacts ? hivesmoke #1468
Archived 2 artifacts
Archive block size is 32768
Received 0 blocks and 138549 bytes
Compression is 0.0%
Took 0.28 sec
[JENKINS] Archiving <https://builds.apache.org/job/Bigtop-trunk-testartifacts/ws/bigtop-tests/test-artifacts/flume/pom.xml>
to org.apache.bigtop.itest/flume-smoke/0.8.0-SNAPSHOT/flume-smoke-0.8.0-SNAPSHOT.pom
Sending artifact delta relative to Bigtop-trunk-testartifacts ? flumesmoke #1422
Archived 1 artifacts
Archive block size is 32768
Received 0 blocks and 1677 bytes
Compression is 0.0%
Took 0.13 sec
[JENKINS] Archiving <https://builds.apache.org/job/Bigtop-trunk-testartifacts/ws/bigtop-tests/test-artifacts/httpfs/pom.xml>
to org.apache.bigtop.itest/httpfs-smoke/0.8.0-SNAPSHOT/httpfs-smoke-0.8.0-SNAPSHOT.pom
[JENKINS] Archiving <https://builds.apache.org/job/Bigtop-trunk-testartifacts/ws/bigtop-tests/test-artifacts/httpfs/target/httpfs-smoke-0.8.0-SNAPSHOT.jar>
to org.apache.bigtop.itest/httpfs-smoke/0.8.0-20140802.193612-46/httpfs-smoke-0.8.0-20140802.193612-46.jar
Sending artifact delta relative to Bigtop-trunk-testartifacts ? httpfssmokes #1468
Archived 2 artifacts
Archive block size is 32768
Received 0 blocks and 17687 bytes
Compression is 0.0%
Took 2.1 sec
[JENKINS] Archiving <https://builds.apache.org/job/Bigtop-trunk-testartifacts/ws/bigtop-tests/test-artifacts/spark/pom.xml>
to org.apache.bigtop.itest/spark-smoke/0.8.0-SNAPSHOT/spark-smoke-0.8.0-SNAPSHOT.pom
Sending artifact delta relative to Bigtop-trunk-testartifacts ? sparksmoke #1422
Archived 1 artifacts
Archive block size is 32768
Received 0 blocks and 2267 bytes
Compression is 0.0%
Took 71 ms
[JENKINS] Archiving <https://builds.apache.org/job/Bigtop-trunk-testartifacts/ws/bigtop-tests/test-artifacts/hadoop/pom.xml>
to org.apache.bigtop.itest/hadoop-smoke/0.8.0-SNAPSHOT/hadoop-smoke-0.8.0-SNAPSHOT.pom
[JENKINS] Archiving <https://builds.apache.org/job/Bigtop-trunk-testartifacts/ws/bigtop-tests/test-artifacts/hadoop/target/hadoop-smoke-0.8.0-SNAPSHOT.jar>
to org.apache.bigtop.itest/hadoop-smoke/0.8.0-20140802.193551-64/hadoop-smoke-0.8.0-20140802.193551-64.jar
Sending artifact delta relative to Bigtop-trunk-testartifacts ? hadoopsmoke #1468
Archived 2 artifacts
Archive block size is 32768
Received 2 blocks and 257276 bytes
Compression is 20.3%
Took 0.17 sec
[JENKINS] Archiving <https://builds.apache.org/job/Bigtop-trunk-testartifacts/ws/bigtop-tests/test-artifacts/oozie/pom.xml>
to org.apache.bigtop.itest/oozie-smoke/0.8.0-SNAPSHOT/oozie-smoke-0.8.0-SNAPSHOT.pom
[JENKINS] Archiving <https://builds.apache.org/job/Bigtop-trunk-testartifacts/ws/bigtop-tests/test-artifacts/oozie/target/oozie-smoke-0.8.0-SNAPSHOT.jar>
to org.apache.bigtop.itest/oozie-smoke/0.8.0-20140802.193621-64/oozie-smoke-0.8.0-20140802.193621-64.jar
Sending artifact delta relative to Bigtop-trunk-testartifacts ? ooziesmoke #1468
Archived 2 artifacts
Archive block size is 32768
Received 0 blocks and 16596 bytes
Compression is 0.0%
Took 54 ms
[JENKINS] Archiving <https://builds.apache.org/job/Bigtop-trunk-testartifacts/ws/bigtop-tests/test-artifacts/giraph/pom.xml>
to org.apache.bigtop.itest/giraph-smoke/0.8.0-SNAPSHOT/giraph-smoke-0.8.0-SNAPSHOT.pom
Sending artifact delta relative to Bigtop-trunk-testartifacts ? giraphsmoke #1422
Archived 1 artifacts
Archive block size is 32768
Received 0 blocks and 1522 bytes
Compression is 0.0%
Took 65 ms
[JENKINS] Archiving <https://builds.apache.org/job/Bigtop-trunk-testartifacts/ws/bigtop-tests/test-artifacts/hcatalog/pom.xml>
to org.apache.bigtop.itest/hcatalog-smoke/0.8.0-SNAPSHOT/hcatalog-smoke-0.8.0-SNAPSHOT.pom
Sending artifact delta relative to Bigtop-trunk-testartifacts ? hcatalogsmoke #1422
Archived 1 artifacts
Archive block size is 32768
Received 0 blocks and 1529 bytes
Compression is 0.0%
Took 78 ms
[JENKINS] Archiving <https://builds.apache.org/job/Bigtop-trunk-testartifacts/ws/bigtop-tests/test-artifacts/datafu/pom.xml>
to org.apache.bigtop.itest/datafu-smoke/0.8.0-SNAPSHOT/datafu-smoke-0.8.0-SNAPSHOT.pom
Sending artifact delta relative to Bigtop-trunk-testartifacts ? datafusmoke #1422
Archived 1 artifacts
Archive block size is 32768
Received 0 blocks and 2405 bytes
Compression is 0.0%
Took 72 ms
[JENKINS] Archiving <https://builds.apache.org/job/Bigtop-trunk-testartifacts/ws/bigtop-tests/test-artifacts/longevity/pom.xml>
to org.apache.bigtop.itest/io-longevity/0.8.0-SNAPSHOT/io-longevity-0.8.0-SNAPSHOT.pom
Sending artifact delta relative to Bigtop-trunk-testartifacts ? io-longevity #1422
Archived 1 artifacts
Archive block size is 32768
Received 0 blocks and 1699 bytes
Compression is 0.0%
Took 37 ms
[JENKINS] Archiving <https://builds.apache.org/job/Bigtop-trunk-testartifacts/ws/bigtop-tests/test-artifacts/mahout/pom.xml>
to org.apache.bigtop.itest/mahout-smoke/0.8.0-SNAPSHOT/mahout-smoke-0.8.0-SNAPSHOT.pom
Sending artifact delta relative to Bigtop-trunk-testartifacts ? mahoutsmoke #1422
Archived 1 artifacts
Archive block size is 32768
Received 0 blocks and 1522 bytes
Compression is 0.0%
Took 2.1 sec
[JENKINS] Archiving <https://builds.apache.org/job/Bigtop-trunk-testartifacts/ws/bigtop-tests/test-artifacts/solr/pom.xml>
to org.apache.bigtop.itest/solr-smoke/0.8.0-SNAPSHOT/solr-smoke-0.8.0-SNAPSHOT.pom
Sending artifact delta relative to Bigtop-trunk-testartifacts ? solrsmoke #1422
Archived 1 artifacts
Archive block size is 32768
Received 0 blocks and 1784 bytes
Compression is 0.0%
Took 49 ms
[JENKINS] Archiving <https://builds.apache.org/job/Bigtop-trunk-testartifacts/ws/bigtop-tests/test-artifacts/hbase/pom.xml>
to org.apache.bigtop.itest/hbase-smoke/0.8.0-SNAPSHOT/hbase-smoke-0.8.0-SNAPSHOT.pom
Sending artifact delta relative to Bigtop-trunk-testartifacts ? hbasesmoke #1422
Archived 1 artifacts
Archive block size is 32768
Received 0 blocks and 2339 bytes
Compression is 0.0%
Took 70 ms
[JENKINS] Archiving <https://builds.apache.org/job/Bigtop-trunk-testartifacts/ws/bigtop-tests/test-artifacts/phoenix/pom.xml>
to org.apache.bigtop.itest/phoenix-smoke/0.8.0-SNAPSHOT/phoenix-smoke-0.8.0-SNAPSHOT.pom
Sending artifact delta relative to Bigtop-trunk-testartifacts ? phoenixsmoke #1422
Archived 1 artifacts
Archive block size is 32768
Received 0 blocks and 1526 bytes
Compression is 0.0%
Took 92 ms
[JENKINS] Archiving <https://builds.apache.org/job/Bigtop-trunk-testartifacts/ws/bigtop-tests/test-artifacts/fatjar/pom.xml>
to org.apache.bigtop.itest/fat-smoke/0.8.0-SNAPSHOT/fat-smoke-0.8.0-SNAPSHOT.pom
Sending artifact delta relative to Bigtop-trunk-testartifacts ? fatjar #1422
Archived 1 artifacts
Archive block size is 32768
Received 0 blocks and 4628 bytes
Compression is 0.0%
Took 3.2 sec
Sending e-mails to: ci@bigtop.apache.org
channel stopped

Mime
View raw message