bigtop-ci mailing list archives

Site index · List index
Message view « Date » · « Thread »
Top « Date » · « Thread »
From Apache Jenkins Server <jenk...@builds.apache.org>
Subject Build failed in Jenkins: Bigtop-trunk-iTest #1734
Date Sun, 13 Jul 2014 05:18:57 GMT
See <https://builds.apache.org/job/Bigtop-trunk-iTest/1734/>

------------------------------------------
Started by upstream project "Bigtop-trunk" build number 1067
originally caused by:
 Started by an SCM change
Building remotely on ubuntu-1 (Ubuntu ubuntu) in workspace <https://builds.apache.org/job/Bigtop-trunk-iTest/ws/>
java.io.IOException: Failed to install http://archive.apache.org/dist/maven/binaries/apache-maven-3.0.4-bin.zip
to /home/hudson/tools/maven/apache-maven-3.0.4
	at hudson.FilePath.installIfNecessaryFrom(FilePath.java:766)
	at hudson.tools.DownloadFromUrlInstaller.performInstallation(DownloadFromUrlInstaller.java:70)
	at hudson.tools.InstallerTranslator.getToolHome(InstallerTranslator.java:61)
	at hudson.tools.ToolLocationNodeProperty.getToolHome(ToolLocationNodeProperty.java:107)
	at hudson.tools.ToolInstallation.translateFor(ToolInstallation.java:204)
	at hudson.tasks.Maven$MavenInstallation.forNode(Maven.java:610)
	at hudson.maven.MavenModuleSetBuild.getEnvironment(MavenModuleSetBuild.java:182)
	at hudson.plugins.git.GitSCM.checkout(GitSCM.java:873)
	at hudson.model.AbstractProject.checkout(AbstractProject.java:1414)
	at hudson.model.AbstractBuild$AbstractBuildExecution.defaultCheckout(AbstractBuild.java:671)
	at jenkins.scm.SCMCheckoutStrategy.checkout(SCMCheckoutStrategy.java:88)
	at hudson.model.AbstractBuild$AbstractBuildExecution.run(AbstractBuild.java:580)
	at hudson.model.Run.execute(Run.java:1676)
	at hudson.maven.MavenModuleSetBuild.run(MavenModuleSetBuild.java:529)
	at hudson.model.ResourceController.execute(ResourceController.java:88)
	at hudson.model.Executor.run(Executor.java:231)
Caused by: java.io.IOException: Failed to mkdirs: /home/hudson/tools/maven/apache-maven-3.0.4
	at hudson.FilePath.mkdirs(FilePath.java:1069)
	at hudson.FilePath.installIfNecessaryFrom(FilePath.java:732)
	... 15 more
Retrying after 10 seconds
java.io.IOException: Failed to install http://archive.apache.org/dist/maven/binaries/apache-maven-3.0.4-bin.zip
to /home/hudson/tools/maven/apache-maven-3.0.4
	at hudson.FilePath.installIfNecessaryFrom(FilePath.java:766)
	at hudson.tools.DownloadFromUrlInstaller.performInstallation(DownloadFromUrlInstaller.java:70)
	at hudson.tools.InstallerTranslator.getToolHome(InstallerTranslator.java:61)
	at hudson.tools.ToolLocationNodeProperty.getToolHome(ToolLocationNodeProperty.java:107)
	at hudson.tools.ToolInstallation.translateFor(ToolInstallation.java:204)
	at hudson.tasks.Maven$MavenInstallation.forNode(Maven.java:610)
	at hudson.maven.MavenModuleSetBuild.getEnvironment(MavenModuleSetBuild.java:182)
	at hudson.plugins.git.GitSCM.checkout(GitSCM.java:873)
	at hudson.model.AbstractProject.checkout(AbstractProject.java:1414)
	at hudson.model.AbstractBuild$AbstractBuildExecution.defaultCheckout(AbstractBuild.java:671)
	at jenkins.scm.SCMCheckoutStrategy.checkout(SCMCheckoutStrategy.java:88)
	at hudson.model.AbstractBuild$AbstractBuildExecution.run(AbstractBuild.java:580)
	at hudson.model.Run.execute(Run.java:1676)
	at hudson.maven.MavenModuleSetBuild.run(MavenModuleSetBuild.java:529)
	at hudson.model.ResourceController.execute(ResourceController.java:88)
	at hudson.model.Executor.run(Executor.java:231)
Caused by: java.io.IOException: Failed to mkdirs: /home/hudson/tools/maven/apache-maven-3.0.4
	at hudson.FilePath.mkdirs(FilePath.java:1069)
	at hudson.FilePath.installIfNecessaryFrom(FilePath.java:732)
	... 15 more
Retrying after 10 seconds
java.io.IOException: Failed to install http://archive.apache.org/dist/maven/binaries/apache-maven-3.0.4-bin.zip
to /home/hudson/tools/maven/apache-maven-3.0.4
	at hudson.FilePath.installIfNecessaryFrom(FilePath.java:766)
	at hudson.tools.DownloadFromUrlInstaller.performInstallation(DownloadFromUrlInstaller.java:70)
	at hudson.tools.InstallerTranslator.getToolHome(InstallerTranslator.java:61)
	at hudson.tools.ToolLocationNodeProperty.getToolHome(ToolLocationNodeProperty.java:107)
	at hudson.tools.ToolInstallation.translateFor(ToolInstallation.java:204)
	at hudson.tasks.Maven$MavenInstallation.forNode(Maven.java:610)
	at hudson.maven.MavenModuleSetBuild.getEnvironment(MavenModuleSetBuild.java:182)
	at hudson.plugins.git.GitSCM.checkout(GitSCM.java:873)
	at hudson.model.AbstractProject.checkout(AbstractProject.java:1414)
	at hudson.model.AbstractBuild$AbstractBuildExecution.defaultCheckout(AbstractBuild.java:671)
	at jenkins.scm.SCMCheckoutStrategy.checkout(SCMCheckoutStrategy.java:88)
	at hudson.model.AbstractBuild$AbstractBuildExecution.run(AbstractBuild.java:580)
	at hudson.model.Run.execute(Run.java:1676)
	at hudson.maven.MavenModuleSetBuild.run(MavenModuleSetBuild.java:529)
	at hudson.model.ResourceController.execute(ResourceController.java:88)
	at hudson.model.Executor.run(Executor.java:231)
Caused by: java.io.IOException: Failed to mkdirs: /home/hudson/tools/maven/apache-maven-3.0.4
	at hudson.FilePath.mkdirs(FilePath.java:1069)
	at hudson.FilePath.installIfNecessaryFrom(FilePath.java:732)
	... 15 more

Mime
View raw message