bigtop-ci mailing list archives

Site index · List index
Message view « Date » · « Thread »
Top « Date » · « Thread »
From Apache Jenkins Server <jenk...@builds.apache.org>
Subject Build failed in Jenkins: Bigtop-trunk-testartifacts #1435
Date Wed, 18 Jun 2014 17:11:04 GMT
See <https://builds.apache.org/job/Bigtop-trunk-testartifacts/1435/changes>

Changes:

[mark] BIGTOP-986: install-flume.sh uses -x instead of -e

------------------------------------------
[...truncated 452 lines...]
[INFO] ------------------------------------------------------------------------
Downloading: http://repo.maven.apache.org/maven2/org/apache/hadoop/hadoop-client/2.3.0/hadoop-client-2.3.0.pom
Downloaded: http://repo.maven.apache.org/maven2/org/apache/hadoop/hadoop-client/2.3.0/hadoop-client-2.3.0.pom
(11 KB at 196.4 KB/sec)
Downloading: http://repo.maven.apache.org/maven2/org/apache/hadoop/hadoop-mapreduce-client-app/2.3.0/hadoop-mapreduce-client-app-2.3.0.pom
Downloaded: http://repo.maven.apache.org/maven2/org/apache/hadoop/hadoop-mapreduce-client-app/2.3.0/hadoop-mapreduce-client-app-2.3.0.pom
(5 KB at 146.0 KB/sec)
Downloading: http://repo.maven.apache.org/maven2/org/apache/hadoop/hadoop-mapreduce-client/2.3.0/hadoop-mapreduce-client-2.3.0.pom
Downloaded: http://repo.maven.apache.org/maven2/org/apache/hadoop/hadoop-mapreduce-client/2.3.0/hadoop-mapreduce-client-2.3.0.pom
(7 KB at 47.1 KB/sec)
Downloading: http://repo.maven.apache.org/maven2/org/apache/hadoop/hadoop-mapreduce-client-common/2.3.0/hadoop-mapreduce-client-common-2.3.0.pom
Downloaded: http://repo.maven.apache.org/maven2/org/apache/hadoop/hadoop-mapreduce-client-common/2.3.0/hadoop-mapreduce-client-common-2.3.0.pom
(4 KB at 59.2 KB/sec)
Downloading: http://repo.maven.apache.org/maven2/org/apache/hadoop/hadoop-yarn-common/2.3.0/hadoop-yarn-common-2.3.0.pom
Downloaded: http://repo.maven.apache.org/maven2/org/apache/hadoop/hadoop-yarn-common/2.3.0/hadoop-yarn-common-2.3.0.pom
(9 KB at 220.3 KB/sec)
Downloading: http://repo.maven.apache.org/maven2/org/apache/hadoop/hadoop-yarn/2.3.0/hadoop-yarn-2.3.0.pom
Downloaded: http://repo.maven.apache.org/maven2/org/apache/hadoop/hadoop-yarn/2.3.0/hadoop-yarn-2.3.0.pom
(4 KB at 90.8 KB/sec)
Downloading: http://repo.maven.apache.org/maven2/org/apache/hadoop/hadoop-yarn-api/2.3.0/hadoop-yarn-api-2.3.0.pom
Downloaded: http://repo.maven.apache.org/maven2/org/apache/hadoop/hadoop-yarn-api/2.3.0/hadoop-yarn-api-2.3.0.pom
(5 KB at 121.1 KB/sec)
Downloading: http://repo.maven.apache.org/maven2/org/apache/hadoop/hadoop-yarn-client/2.3.0/hadoop-yarn-client-2.3.0.pom
Downloaded: http://repo.maven.apache.org/maven2/org/apache/hadoop/hadoop-yarn-client/2.3.0/hadoop-yarn-client-2.3.0.pom
(5 KB at 170.3 KB/sec)
Downloading: http://repo.maven.apache.org/maven2/org/apache/hadoop/hadoop-mapreduce-client-core/2.3.0/hadoop-mapreduce-client-core-2.3.0.pom
Downloaded: http://repo.maven.apache.org/maven2/org/apache/hadoop/hadoop-mapreduce-client-core/2.3.0/hadoop-mapreduce-client-core-2.3.0.pom
(4 KB at 65.5 KB/sec)
Downloading: http://repo.maven.apache.org/maven2/org/apache/hadoop/hadoop-yarn-server-common/2.3.0/hadoop-yarn-server-common-2.3.0.pom
Downloaded: http://repo.maven.apache.org/maven2/org/apache/hadoop/hadoop-yarn-server-common/2.3.0/hadoop-yarn-server-common-2.3.0.pom
(6 KB at 150.7 KB/sec)
Downloading: http://repo.maven.apache.org/maven2/org/apache/hadoop/hadoop-yarn-server/2.3.0/hadoop-yarn-server-2.3.0.pom
Downloaded: http://repo.maven.apache.org/maven2/org/apache/hadoop/hadoop-yarn-server/2.3.0/hadoop-yarn-server-2.3.0.pom
(2 KB at 16.3 KB/sec)
Downloading: http://repo.maven.apache.org/maven2/org/apache/hadoop/hadoop-mapreduce-client-shuffle/2.3.0/hadoop-mapreduce-client-shuffle-2.3.0.pom
Downloaded: http://repo.maven.apache.org/maven2/org/apache/hadoop/hadoop-mapreduce-client-shuffle/2.3.0/hadoop-mapreduce-client-shuffle-2.3.0.pom
(2 KB at 40.9 KB/sec)
Downloading: http://repo.maven.apache.org/maven2/org/apache/hadoop/hadoop-mapreduce-client-jobclient/2.3.0/hadoop-mapreduce-client-jobclient-2.3.0.pom
Downloaded: http://repo.maven.apache.org/maven2/org/apache/hadoop/hadoop-mapreduce-client-jobclient/2.3.0/hadoop-mapreduce-client-jobclient-2.3.0.pom
(6 KB at 184.3 KB/sec)
Downloading: http://repo.maven.apache.org/maven2/org/apache/hadoop/hadoop-yarn-server-nodemanager/2.3.0/hadoop-yarn-server-nodemanager-2.3.0.pom
Downloaded: http://repo.maven.apache.org/maven2/org/apache/hadoop/hadoop-yarn-server-nodemanager/2.3.0/hadoop-yarn-server-nodemanager-2.3.0.pom
(12 KB at 292.6 KB/sec)
Downloading: http://repo.maven.apache.org/maven2/org/apache/hbase/hbase-common/0.98.2/hbase-common-0.98.2.pom
[WARNING] The POM for org.apache.hbase:hbase-common:jar:0.98.2 is missing, no dependency information
available
Downloading: http://repo.maven.apache.org/maven2/org/apache/hbase/hbase-common/0.98.2/hbase-common-0.98.2.pom
[WARNING] The POM for org.apache.hbase:hbase-common:jar:tests:0.98.2 is missing, no dependency
information available
Downloading: http://repo.maven.apache.org/maven2/org/apache/hbase/hbase-server/0.98.2/hbase-server-0.98.2.pom
[WARNING] The POM for org.apache.hbase:hbase-server:jar:0.98.2 is missing, no dependency information
available
Downloading: http://repo.maven.apache.org/maven2/org/apache/hbase/hbase-server/0.98.2/hbase-server-0.98.2.pom
[WARNING] The POM for org.apache.hbase:hbase-server:jar:tests:0.98.2 is missing, no dependency
information available
Downloading: http://repo.maven.apache.org/maven2/org/apache/hadoop/hadoop-client/2.3.0/hadoop-client-2.3.0.jar
Downloading: http://repo.maven.apache.org/maven2/org/apache/hadoop/hadoop-mapreduce-client-app/2.3.0/hadoop-mapreduce-client-app-2.3.0.jar
Downloading: http://repo.maven.apache.org/maven2/org/apache/hadoop/hadoop-mapreduce-client-common/2.3.0/hadoop-mapreduce-client-common-2.3.0.jar
Downloading: http://repo.maven.apache.org/maven2/org/apache/hadoop/hadoop-yarn-client/2.3.0/hadoop-yarn-client-2.3.0.jar
Downloading: http://repo.maven.apache.org/maven2/org/apache/hadoop/hadoop-yarn-server-common/2.3.0/hadoop-yarn-server-common-2.3.0.jar
Downloaded: http://repo.maven.apache.org/maven2/org/apache/hadoop/hadoop-client/2.3.0/hadoop-client-2.3.0.jar
(3 KB at 62.5 KB/sec)
Downloading: http://repo.maven.apache.org/maven2/org/apache/hadoop/hadoop-mapreduce-client-shuffle/2.3.0/hadoop-mapreduce-client-shuffle-2.3.0.jar
Downloaded: http://repo.maven.apache.org/maven2/org/apache/hadoop/hadoop-yarn-client/2.3.0/hadoop-yarn-client-2.3.0.jar
(94 KB at 1231.8 KB/sec)
Downloading: http://repo.maven.apache.org/maven2/org/apache/hadoop/hadoop-yarn-api/2.3.0/hadoop-yarn-api-2.3.0.jar
Downloaded: http://repo.maven.apache.org/maven2/org/apache/hadoop/hadoop-mapreduce-client-shuffle/2.3.0/hadoop-mapreduce-client-shuffle-2.3.0.jar
(22 KB at 548.8 KB/sec)
Downloading: http://repo.maven.apache.org/maven2/org/apache/hadoop/hadoop-mapreduce-client-core/2.3.0/hadoop-mapreduce-client-core-2.3.0.jar
Downloaded: http://repo.maven.apache.org/maven2/org/apache/hadoop/hadoop-yarn-server-common/2.3.0/hadoop-yarn-server-common-2.3.0.jar
(182 KB at 1818.3 KB/sec)
Downloading: http://repo.maven.apache.org/maven2/org/apache/hadoop/hadoop-yarn-common/2.3.0/hadoop-yarn-common-2.3.0.jar
Downloaded: http://repo.maven.apache.org/maven2/org/apache/hadoop/hadoop-mapreduce-client-app/2.3.0/hadoop-mapreduce-client-app-2.3.0.jar
(474 KB at 3287.3 KB/sec)
Downloading: http://repo.maven.apache.org/maven2/org/apache/hadoop/hadoop-mapreduce-client-jobclient/2.3.0/hadoop-mapreduce-client-jobclient-2.3.0.jar
Downloaded: http://repo.maven.apache.org/maven2/org/apache/hadoop/hadoop-mapreduce-client-common/2.3.0/hadoop-mapreduce-client-common-2.3.0.jar
(646 KB at 4137.3 KB/sec)
Downloading: http://repo.maven.apache.org/maven2/org/apache/hbase/hbase-common/0.98.2/hbase-common-0.98.2.jar
Downloaded: http://repo.maven.apache.org/maven2/org/apache/hadoop/hadoop-mapreduce-client-jobclient/2.3.0/hadoop-mapreduce-client-jobclient-2.3.0.jar
(35 KB at 1146.6 KB/sec)
Downloading: http://repo.maven.apache.org/maven2/org/apache/hbase/hbase-common/0.98.2/hbase-common-0.98.2-tests.jar
Downloaded: http://repo.maven.apache.org/maven2/org/apache/hadoop/hadoop-yarn-api/2.3.0/hadoop-yarn-api-2.3.0.jar
(1264 KB at 8775.4 KB/sec)
Downloading: http://repo.maven.apache.org/maven2/org/apache/hbase/hbase-server/0.98.2/hbase-server-0.98.2.jar
Downloading: http://repo.maven.apache.org/maven2/org/apache/hbase/hbase-server/0.98.2/hbase-server-0.98.2-tests.jar
Downloaded: http://repo.maven.apache.org/maven2/org/apache/hadoop/hadoop-mapreduce-client-core/2.3.0/hadoop-mapreduce-client-core-2.3.0.jar
(1440 KB at 7575.5 KB/sec)
Downloaded: http://repo.maven.apache.org/maven2/org/apache/hadoop/hadoop-yarn-common/2.3.0/hadoop-yarn-common-2.3.0.jar
(1306 KB at 7134.9 KB/sec)
[INFO] ------------------------------------------------------------------------
[INFO] Reactor Summary:
[INFO] 
[INFO] bigtop-smokes ..................................... SUCCESS [33.070s]
[INFO] hadoopsmoke ....................................... SUCCESS [18.935s]
[INFO] packagesmoke ...................................... SUCCESS [20.054s]
[INFO] httpfssmokes ...................................... SUCCESS [6.561s]
[INFO] ooziesmoke ........................................ SUCCESS [10.883s]
[INFO] hivesmoke ......................................... SUCCESS [6.287s]
[INFO] hbasesmoke ........................................ FAILURE [2.114s]
[INFO] flumesmoke ........................................ SKIPPED
[INFO] sqoopsmokes ....................................... SKIPPED
[INFO] mahoutsmoke ....................................... SKIPPED
[INFO] giraphsmoke ....................................... SKIPPED
[INFO] huesmoke .......................................... SKIPPED
[INFO] solrsmoke ......................................... SKIPPED
[INFO] crunchsmoke ....................................... SKIPPED
[INFO] datafusmoke ....................................... SKIPPED
[INFO] fatjar ............................................ SKIPPED
[INFO] io-longevity ...................................... SKIPPED
[INFO] hcatalogsmoke ..................................... SKIPPED
[INFO] sparksmoke ........................................ SKIPPED
[INFO] phoenixsmoke ...................................... SKIPPED
[INFO] ------------------------------------------------------------------------
[INFO] BUILD FAILURE
[INFO] ------------------------------------------------------------------------
[INFO] Total time: 1:55.911s
[INFO] Finished at: Wed Jun 18 17:09:55 UTC 2014
[INFO] Final Memory: 24M/88M
[INFO] ------------------------------------------------------------------------
Waiting for Jenkins to finish collecting data
[ERROR] Failed to execute goal on project hbase-smoke: Could not resolve dependencies for
project org.apache.bigtop.itest:hbase-smoke:jar:0.8.0-SNAPSHOT: The following artifacts could
not be resolved: org.apache.hbase:hbase-common:jar:0.98.2, org.apache.hbase:hbase-common:jar:tests:0.98.2,
org.apache.hbase:hbase-server:jar:0.98.2, org.apache.hbase:hbase-server:jar:tests:0.98.2:
Could not find artifact org.apache.hbase:hbase-common:jar:0.98.2 in central (http://repo.maven.apache.org/maven2)
-> [Help 1]
[ERROR] 
[ERROR] To see the full stack trace of the errors, re-run Maven with the -e switch.
[ERROR] Re-run Maven using the -X switch to enable full debug logging.
[ERROR] 
[ERROR] For more information about the errors and possible solutions, please read the following
articles:
[ERROR] [Help 1] http://cwiki.apache.org/confluence/display/MAVEN/DependencyResolutionException
[ERROR] 
[ERROR] After correcting the problems, you can resume the build with the command
[ERROR]   mvn <goals> -rf :hbase-smoke
[JENKINS] Archiving <https://builds.apache.org/job/Bigtop-trunk-testartifacts/ws/bigtop-tests/test-artifacts/pom.xml>
to org.apache.bigtop.itest/bigtop-smokes/0.8.0-SNAPSHOT/bigtop-smokes-0.8.0-SNAPSHOT.pom
Sending artifact delta relative to Bigtop-trunk-testartifacts ? bigtop-smokes #1434
Archived 1 artifacts
Archive block size is 32768
Received 0 blocks and 4920 bytes
Compression is 0.0%
Took 6 sec
[JENKINS] Archiving <https://builds.apache.org/job/Bigtop-trunk-testartifacts/ws/bigtop-tests/test-artifacts/sqoop/pom.xml>
to org.apache.bigtop.itest/sqoop-smoke/0.8.0-SNAPSHOT/sqoop-smoke-0.8.0-SNAPSHOT.pom
Sending artifact delta relative to Bigtop-trunk-testartifacts ? sqoopsmokes #1422
Archived 1 artifacts
Archive block size is 32768
Received 0 blocks and 1837 bytes
Compression is 0.0%
Took 0.2 sec
[JENKINS] Archiving <https://builds.apache.org/job/Bigtop-trunk-testartifacts/ws/bigtop-tests/test-artifacts/hue/pom.xml>
to org.apache.bigtop.itest/hue-smoke/0.8.0-SNAPSHOT/hue-smoke-0.8.0-SNAPSHOT.pom
Sending artifact delta relative to Bigtop-trunk-testartifacts ? huesmoke #1422
Archived 1 artifacts
Archive block size is 32768
Received 0 blocks and 1510 bytes
Compression is 0.0%
Took 2.3 sec
[JENKINS] Archiving <https://builds.apache.org/job/Bigtop-trunk-testartifacts/ws/bigtop-tests/test-artifacts/crunch/pom.xml>
to org.apache.bigtop.itest/crunch-smoke/0.8.0-SNAPSHOT/crunch-smoke-0.8.0-SNAPSHOT.pom
Sending artifact delta relative to Bigtop-trunk-testartifacts ? crunchsmoke #1422
Archived 1 artifacts
Archive block size is 32768
Received 0 blocks and 1521 bytes
Compression is 0.0%
Took 0.34 sec
[JENKINS] Archiving <https://builds.apache.org/job/Bigtop-trunk-testartifacts/ws/bigtop-tests/test-artifacts/package/pom.xml>
to org.apache.bigtop.itest/package-smoke/0.8.0-SNAPSHOT/package-smoke-0.8.0-SNAPSHOT.pom
[JENKINS] Archiving <https://builds.apache.org/job/Bigtop-trunk-testartifacts/ws/bigtop-tests/test-artifacts/package/target/package-smoke-0.8.0-SNAPSHOT.jar>
to org.apache.bigtop.itest/package-smoke/0.8.0-20140618.170919-33/package-smoke-0.8.0-20140618.170919-33.jar
Sending artifact delta relative to Bigtop-trunk-testartifacts ? packagesmoke #1434
Archived 2 artifacts
Archive block size is 32768
Received 1 blocks and 791873 bytes
Compression is 4.0%
Took 2.3 sec
[JENKINS] Archiving <https://builds.apache.org/job/Bigtop-trunk-testartifacts/ws/bigtop-tests/test-artifacts/hive/pom.xml>
to org.apache.bigtop.itest/hive-smoke/0.8.0-SNAPSHOT/hive-smoke-0.8.0-SNAPSHOT.pom
[JENKINS] Archiving <https://builds.apache.org/job/Bigtop-trunk-testartifacts/ws/bigtop-tests/test-artifacts/hive/target/hive-smoke-0.8.0-SNAPSHOT.jar>
to org.apache.bigtop.itest/hive-smoke/0.8.0-20140618.170947-33/hive-smoke-0.8.0-20140618.170947-33.jar
Sending artifact delta relative to Bigtop-trunk-testartifacts ? hivesmoke #1434
Archived 2 artifacts
Archive block size is 32768
Received 0 blocks and 138550 bytes
Compression is 0.0%
Took 0.8 sec
[JENKINS] Archiving <https://builds.apache.org/job/Bigtop-trunk-testartifacts/ws/bigtop-tests/test-artifacts/flume/pom.xml>
to org.apache.bigtop.itest/flume-smoke/0.8.0-SNAPSHOT/flume-smoke-0.8.0-SNAPSHOT.pom
Sending artifact delta relative to Bigtop-trunk-testartifacts ? flumesmoke #1422
Archived 1 artifacts
Archive block size is 32768
Received 0 blocks and 1677 bytes
Compression is 0.0%
Took 0.23 sec
[JENKINS] Archiving <https://builds.apache.org/job/Bigtop-trunk-testartifacts/ws/bigtop-tests/test-artifacts/httpfs/pom.xml>
to org.apache.bigtop.itest/httpfs-smoke/0.8.0-SNAPSHOT/httpfs-smoke-0.8.0-SNAPSHOT.pom
[JENKINS] Archiving <https://builds.apache.org/job/Bigtop-trunk-testartifacts/ws/bigtop-tests/test-artifacts/httpfs/target/httpfs-smoke-0.8.0-SNAPSHOT.jar>
to org.apache.bigtop.itest/httpfs-smoke/0.8.0-20140618.170929-15/httpfs-smoke-0.8.0-20140618.170929-15.jar
Sending artifact delta relative to Bigtop-trunk-testartifacts ? httpfssmokes #1434
Archived 2 artifacts
Archive block size is 32768
Received 0 blocks and 17688 bytes
Compression is 0.0%
Took 0.23 sec
[JENKINS] Archiving <https://builds.apache.org/job/Bigtop-trunk-testartifacts/ws/bigtop-tests/test-artifacts/spark/pom.xml>
to org.apache.bigtop.itest/spark-smoke/0.8.0-SNAPSHOT/spark-smoke-0.8.0-SNAPSHOT.pom
Sending artifact delta relative to Bigtop-trunk-testartifacts ? sparksmoke #1422
Archived 1 artifacts
Archive block size is 32768
Received 0 blocks and 2267 bytes
Compression is 0.0%
Took 0.5 sec
[JENKINS] Archiving <https://builds.apache.org/job/Bigtop-trunk-testartifacts/ws/bigtop-tests/test-artifacts/hadoop/pom.xml>
to org.apache.bigtop.itest/hadoop-smoke/0.8.0-SNAPSHOT/hadoop-smoke-0.8.0-SNAPSHOT.pom
[JENKINS] Archiving <https://builds.apache.org/job/Bigtop-trunk-testartifacts/ws/bigtop-tests/test-artifacts/hadoop/target/hadoop-smoke-0.8.0-SNAPSHOT.jar>
to org.apache.bigtop.itest/hadoop-smoke/0.8.0-20140618.170859-33/hadoop-smoke-0.8.0-20140618.170859-33.jar
Sending artifact delta relative to Bigtop-trunk-testartifacts ? hadoopsmoke #1434
Archived 2 artifacts
Archive block size is 32768
Received 2 blocks and 254505 bytes
Compression is 20.5%
Took 2.6 sec
[JENKINS] Archiving <https://builds.apache.org/job/Bigtop-trunk-testartifacts/ws/bigtop-tests/test-artifacts/oozie/pom.xml>
to org.apache.bigtop.itest/oozie-smoke/0.8.0-SNAPSHOT/oozie-smoke-0.8.0-SNAPSHOT.pom
[JENKINS] Archiving <https://builds.apache.org/job/Bigtop-trunk-testartifacts/ws/bigtop-tests/test-artifacts/oozie/target/oozie-smoke-0.8.0-SNAPSHOT.jar>
to org.apache.bigtop.itest/oozie-smoke/0.8.0-20140618.170936-33/oozie-smoke-0.8.0-20140618.170936-33.jar
Sending artifact delta relative to Bigtop-trunk-testartifacts ? ooziesmoke #1434
Archived 2 artifacts
Archive block size is 32768
Received 0 blocks and 16519 bytes
Compression is 0.0%
Took 0.26 sec
[JENKINS] Archiving <https://builds.apache.org/job/Bigtop-trunk-testartifacts/ws/bigtop-tests/test-artifacts/giraph/pom.xml>
to org.apache.bigtop.itest/giraph-smoke/0.8.0-SNAPSHOT/giraph-smoke-0.8.0-SNAPSHOT.pom
Sending artifact delta relative to Bigtop-trunk-testartifacts ? giraphsmoke #1422
Archived 1 artifacts
Archive block size is 32768
Received 0 blocks and 1522 bytes
Compression is 0.0%
Took 0.15 sec
[JENKINS] Archiving <https://builds.apache.org/job/Bigtop-trunk-testartifacts/ws/bigtop-tests/test-artifacts/hcatalog/pom.xml>
to org.apache.bigtop.itest/hcatalog-smoke/0.8.0-SNAPSHOT/hcatalog-smoke-0.8.0-SNAPSHOT.pom
Sending artifact delta relative to Bigtop-trunk-testartifacts ? hcatalogsmoke #1422
Archived 1 artifacts
Archive block size is 32768
Received 0 blocks and 1529 bytes
Compression is 0.0%
Took 0.13 sec
[JENKINS] Archiving <https://builds.apache.org/job/Bigtop-trunk-testartifacts/ws/bigtop-tests/test-artifacts/datafu/pom.xml>
to org.apache.bigtop.itest/datafu-smoke/0.8.0-SNAPSHOT/datafu-smoke-0.8.0-SNAPSHOT.pom
Sending artifact delta relative to Bigtop-trunk-testartifacts ? datafusmoke #1422
Archived 1 artifacts
Archive block size is 32768
Received 0 blocks and 2405 bytes
Compression is 0.0%
Took 0.1 sec
[JENKINS] Archiving <https://builds.apache.org/job/Bigtop-trunk-testartifacts/ws/bigtop-tests/test-artifacts/longevity/pom.xml>
to org.apache.bigtop.itest/io-longevity/0.8.0-SNAPSHOT/io-longevity-0.8.0-SNAPSHOT.pom
Sending artifact delta relative to Bigtop-trunk-testartifacts ? io-longevity #1422
Archived 1 artifacts
Archive block size is 32768
Received 0 blocks and 1699 bytes
Compression is 0.0%
Took 2.3 sec
[JENKINS] Archiving <https://builds.apache.org/job/Bigtop-trunk-testartifacts/ws/bigtop-tests/test-artifacts/mahout/pom.xml>
to org.apache.bigtop.itest/mahout-smoke/0.8.0-SNAPSHOT/mahout-smoke-0.8.0-SNAPSHOT.pom
Sending artifact delta relative to Bigtop-trunk-testartifacts ? mahoutsmoke #1422
Archived 1 artifacts
Archive block size is 32768
Received 0 blocks and 1522 bytes
Compression is 0.0%
Took 0.11 sec
[JENKINS] Archiving <https://builds.apache.org/job/Bigtop-trunk-testartifacts/ws/bigtop-tests/test-artifacts/solr/pom.xml>
to org.apache.bigtop.itest/solr-smoke/0.8.0-SNAPSHOT/solr-smoke-0.8.0-SNAPSHOT.pom
Sending artifact delta relative to Bigtop-trunk-testartifacts ? solrsmoke #1422
Archived 1 artifacts
Archive block size is 32768
Received 0 blocks and 1784 bytes
Compression is 0.0%
Took 0.12 sec
[JENKINS] Archiving <https://builds.apache.org/job/Bigtop-trunk-testartifacts/ws/bigtop-tests/test-artifacts/hbase/pom.xml>
to org.apache.bigtop.itest/hbase-smoke/0.8.0-SNAPSHOT/hbase-smoke-0.8.0-SNAPSHOT.pom
Sending artifact delta relative to Bigtop-trunk-testartifacts ? hbasesmoke #1422
Archived 1 artifacts
Archive block size is 32768
Received 0 blocks and 2339 bytes
Compression is 0.0%
Took 0.17 sec
[JENKINS] Archiving <https://builds.apache.org/job/Bigtop-trunk-testartifacts/ws/bigtop-tests/test-artifacts/phoenix/pom.xml>
to org.apache.bigtop.itest/phoenix-smoke/0.8.0-SNAPSHOT/phoenix-smoke-0.8.0-SNAPSHOT.pom
Sending artifact delta relative to Bigtop-trunk-testartifacts ? phoenixsmoke #1422
Archived 1 artifacts
Archive block size is 32768
Received 0 blocks and 1526 bytes
Compression is 0.0%
Took 0.16 sec
[JENKINS] Archiving <https://builds.apache.org/job/Bigtop-trunk-testartifacts/ws/bigtop-tests/test-artifacts/fatjar/pom.xml>
to org.apache.bigtop.itest/fat-smoke/0.8.0-SNAPSHOT/fat-smoke-0.8.0-SNAPSHOT.pom
Sending artifact delta relative to Bigtop-trunk-testartifacts ? fatjar #1422
Archived 1 artifacts
Archive block size is 32768
Received 0 blocks and 4628 bytes
Compression is 0.0%
Took 4.9 sec
Sending e-mails to: ci@bigtop.apache.org
channel stopped

Mime
View raw message