bigtop-ci mailing list archives

Site index · List index
Message view « Date » · « Thread »
Top « Date » · « Thread »
From Apache Jenkins Server <jenk...@builds.apache.org>
Subject Build failed in Jenkins: Bigtop-trunk-testartifacts #1427
Date Thu, 29 May 2014 16:12:28 GMT
See <https://builds.apache.org/job/Bigtop-trunk-testartifacts/1427/changes>

Changes:

[mackrorysd] BIGTOP-1048. ZooKeeper installation use "zookeeper-server.pid" as default while
ZooKeeper expects zookeeper_server.pid. (contributed by Jeffrey Zhong)

------------------------------------------
[...truncated 255 lines...]
[INFO] 
[INFO] --- maven-compiler-plugin:2.3.2:compile (default-compile) @ httpfs-smoke ---
[INFO] Using Groovy-Eclipse compiler to compile both Java and Groovy files
[INFO] 
[INFO] --- maven-resources-plugin:2.4.3:testResources (default-testResources) @ httpfs-smoke
---
[INFO] Using 'UTF-8' encoding to copy filtered resources.
[INFO] skip non existing resourceDirectory <https://builds.apache.org/job/Bigtop-trunk-testartifacts/ws/bigtop-tests/test-artifacts/httpfs/src/test/resources>
[INFO] Copying 3 resources
[INFO] 
[INFO] --- maven-compiler-plugin:2.3.2:testCompile (default-testCompile) @ httpfs-smoke ---
[INFO] No sources to compile
[INFO] 
[INFO] --- maven-surefire-plugin:2.7:test (default-test) @ httpfs-smoke ---
[INFO] Tests are skipped.
[INFO] 
[INFO] --- maven-jar-plugin:2.2:jar (default-jar) @ httpfs-smoke ---
[INFO] Building jar: <https://builds.apache.org/job/Bigtop-trunk-testartifacts/ws/bigtop-tests/test-artifacts/httpfs/target/httpfs-smoke-0.8.0-SNAPSHOT.jar>
[INFO] 
[INFO] --- maven-failsafe-plugin:2.7.1:integration-test (integration-test) @ httpfs-smoke
---
[INFO] No tests to run.
[JENKINS] Recording test results[INFO] 
[INFO] --- maven-failsafe-plugin:2.7.1:verify (verify) @ httpfs-smoke ---
[INFO] No tests to run.

[JENKINS] Recording test results[INFO] 
[INFO] --- maven-install-plugin:2.3:install (default-install) @ httpfs-smoke ---
[INFO] Installing <https://builds.apache.org/job/Bigtop-trunk-testartifacts/ws/bigtop-tests/test-artifacts/httpfs/target/httpfs-smoke-0.8.0-SNAPSHOT.jar>
to /home/jenkins/jenkins-slave/maven-repositories/1/org/apache/bigtop/itest/httpfs-smoke/0.8.0-SNAPSHOT/httpfs-smoke-0.8.0-SNAPSHOT.jar
[INFO] Installing <https://builds.apache.org/job/Bigtop-trunk-testartifacts/ws/bigtop-tests/test-artifacts/httpfs/pom.xml>
to /home/jenkins/jenkins-slave/maven-repositories/1/org/apache/bigtop/itest/httpfs-smoke/0.8.0-SNAPSHOT/httpfs-smoke-0.8.0-SNAPSHOT.pom

[INFO] 
[INFO] --- maven-deploy-plugin:2.5:deploy (default-deploy) @ httpfs-smoke ---
Downloading: https://repository.apache.org/content/repositories/snapshots/org/apache/bigtop/itest/httpfs-smoke/0.8.0-SNAPSHOT/maven-metadata.xml
Downloaded: https://repository.apache.org/content/repositories/snapshots/org/apache/bigtop/itest/httpfs-smoke/0.8.0-SNAPSHOT/maven-metadata.xml
(785 B at 1.3 KB/sec)
Uploading: https://repository.apache.org/content/repositories/snapshots/org/apache/bigtop/itest/httpfs-smoke/0.8.0-SNAPSHOT/httpfs-smoke-0.8.0-20140529.161131-7.jar
Uploaded: https://repository.apache.org/content/repositories/snapshots/org/apache/bigtop/itest/httpfs-smoke/0.8.0-SNAPSHOT/httpfs-smoke-0.8.0-20140529.161131-7.jar
(17 KB at 50.7 KB/sec)
Uploading: https://repository.apache.org/content/repositories/snapshots/org/apache/bigtop/itest/httpfs-smoke/0.8.0-SNAPSHOT/httpfs-smoke-0.8.0-20140529.161131-7.pom
Uploaded: https://repository.apache.org/content/repositories/snapshots/org/apache/bigtop/itest/httpfs-smoke/0.8.0-SNAPSHOT/httpfs-smoke-0.8.0-20140529.161131-7.pom
(2 KB at 3.5 KB/sec)
Downloading: https://repository.apache.org/content/repositories/snapshots/org/apache/bigtop/itest/httpfs-smoke/maven-metadata.xml
Downloaded: https://repository.apache.org/content/repositories/snapshots/org/apache/bigtop/itest/httpfs-smoke/maven-metadata.xml
(295 B at 1.0 KB/sec)
Uploading: https://repository.apache.org/content/repositories/snapshots/org/apache/bigtop/itest/httpfs-smoke/0.8.0-SNAPSHOT/maven-metadata.xml
Uploaded: https://repository.apache.org/content/repositories/snapshots/org/apache/bigtop/itest/httpfs-smoke/0.8.0-SNAPSHOT/maven-metadata.xml
(785 B at 2.0 KB/sec)
Uploading: https://repository.apache.org/content/repositories/snapshots/org/apache/bigtop/itest/httpfs-smoke/maven-metadata.xml
Uploaded: https://repository.apache.org/content/repositories/snapshots/org/apache/bigtop/itest/httpfs-smoke/maven-metadata.xml
(295 B at 0.7 KB/sec)
[INFO]                                                                         
[INFO] ------------------------------------------------------------------------
[INFO] Building ooziesmoke 0.8.0-SNAPSHOT
[INFO] ------------------------------------------------------------------------
[INFO] 
[INFO] --- maven-clean-plugin:2.4.1:clean (default-clean) @ oozie-smoke ---
[INFO] Deleting <https://builds.apache.org/job/Bigtop-trunk-testartifacts/ws/bigtop-tests/test-artifacts/oozie/target>
[INFO] 
[INFO] --- groovy-eclipse-compiler:2.7.0-01:add-groovy-build-paths (default-add-groovy-build-paths)
@ oozie-smoke ---
[INFO] Adding /src/main/groovy to the list of source folders
[INFO] Adding /src/test/groovy to the list of test source folders
[INFO] 
[INFO] --- maven-remote-resources-plugin:1.1:process (default) @ oozie-smoke ---
[INFO] 
[INFO] --- maven-resources-plugin:2.4.3:resources (default-resources) @ oozie-smoke ---
[INFO] Using 'UTF-8' encoding to copy filtered resources.
[INFO] skip non existing resourceDirectory <https://builds.apache.org/job/Bigtop-trunk-testartifacts/ws/bigtop-tests/test-artifacts/oozie/src/main/resources>
[INFO] Copying 3 resources
[INFO] 
[INFO] --- maven-compiler-plugin:2.3.2:compile (default-compile) @ oozie-smoke ---
[INFO] Using Groovy-Eclipse compiler to compile both Java and Groovy files
[INFO] 
[INFO] --- maven-resources-plugin:2.4.3:testResources (default-testResources) @ oozie-smoke
---
[INFO] Using 'UTF-8' encoding to copy filtered resources.
[INFO] skip non existing resourceDirectory <https://builds.apache.org/job/Bigtop-trunk-testartifacts/ws/bigtop-tests/test-artifacts/oozie/src/test/resources>
[INFO] Copying 3 resources
[INFO] 
[INFO] --- maven-compiler-plugin:2.3.2:testCompile (default-testCompile) @ oozie-smoke ---
[INFO] No sources to compile
[INFO] 
[INFO] --- maven-surefire-plugin:2.7:test (default-test) @ oozie-smoke ---
[INFO] Tests are skipped.
[INFO] 
[INFO] --- maven-jar-plugin:2.2:jar (default-jar) @ oozie-smoke ---
[INFO] Building jar: <https://builds.apache.org/job/Bigtop-trunk-testartifacts/ws/bigtop-tests/test-artifacts/oozie/target/oozie-smoke-0.8.0-SNAPSHOT.jar>
[INFO] 
[INFO] --- maven-failsafe-plugin:2.7.1:integration-test (integration-test) @ oozie-smoke ---
[INFO] No tests to run.
[JENKINS] Recording test results[INFO] 
[INFO] --- maven-failsafe-plugin:2.7.1:verify (verify) @ oozie-smoke ---
[INFO] No tests to run.

[JENKINS] Recording test results[INFO] 
[INFO] --- maven-install-plugin:2.3:install (default-install) @ oozie-smoke ---
[INFO] Installing <https://builds.apache.org/job/Bigtop-trunk-testartifacts/ws/bigtop-tests/test-artifacts/oozie/target/oozie-smoke-0.8.0-SNAPSHOT.jar>
to /home/jenkins/jenkins-slave/maven-repositories/1/org/apache/bigtop/itest/oozie-smoke/0.8.0-SNAPSHOT/oozie-smoke-0.8.0-SNAPSHOT.jar
[INFO] Installing <https://builds.apache.org/job/Bigtop-trunk-testartifacts/ws/bigtop-tests/test-artifacts/oozie/pom.xml>
to /home/jenkins/jenkins-slave/maven-repositories/1/org/apache/bigtop/itest/oozie-smoke/0.8.0-SNAPSHOT/oozie-smoke-0.8.0-SNAPSHOT.pom

[INFO] 
[INFO] --- maven-deploy-plugin:2.5:deploy (default-deploy) @ oozie-smoke ---
Downloading: https://repository.apache.org/content/repositories/snapshots/org/apache/bigtop/itest/oozie-smoke/0.8.0-SNAPSHOT/maven-metadata.xml
Downloaded: https://repository.apache.org/content/repositories/snapshots/org/apache/bigtop/itest/oozie-smoke/0.8.0-SNAPSHOT/maven-metadata.xml
(787 B at 1.4 KB/sec)
Uploading: https://repository.apache.org/content/repositories/snapshots/org/apache/bigtop/itest/oozie-smoke/0.8.0-SNAPSHOT/oozie-smoke-0.8.0-20140529.161139-25.jar
Uploaded: https://repository.apache.org/content/repositories/snapshots/org/apache/bigtop/itest/oozie-smoke/0.8.0-SNAPSHOT/oozie-smoke-0.8.0-20140529.161139-25.jar
(15 KB at 41.7 KB/sec)
Uploading: https://repository.apache.org/content/repositories/snapshots/org/apache/bigtop/itest/oozie-smoke/0.8.0-SNAPSHOT/oozie-smoke-0.8.0-20140529.161139-25.pom
Uploaded: https://repository.apache.org/content/repositories/snapshots/org/apache/bigtop/itest/oozie-smoke/0.8.0-SNAPSHOT/oozie-smoke-0.8.0-20140529.161139-25.pom
(2 KB at 4.4 KB/sec)
Downloading: https://repository.apache.org/content/repositories/snapshots/org/apache/bigtop/itest/oozie-smoke/maven-metadata.xml
Downloaded: https://repository.apache.org/content/repositories/snapshots/org/apache/bigtop/itest/oozie-smoke/maven-metadata.xml
(405 B at 1.4 KB/sec)
Uploading: https://repository.apache.org/content/repositories/snapshots/org/apache/bigtop/itest/oozie-smoke/0.8.0-SNAPSHOT/maven-metadata.xml
Uploaded: https://repository.apache.org/content/repositories/snapshots/org/apache/bigtop/itest/oozie-smoke/0.8.0-SNAPSHOT/maven-metadata.xml
(787 B at 2.3 KB/sec)
Uploading: https://repository.apache.org/content/repositories/snapshots/org/apache/bigtop/itest/oozie-smoke/maven-metadata.xml
Uploaded: https://repository.apache.org/content/repositories/snapshots/org/apache/bigtop/itest/oozie-smoke/maven-metadata.xml
(405 B at 0.8 KB/sec)
[INFO]                                                                         
[INFO] ------------------------------------------------------------------------
[INFO] Building hivesmoke 0.8.0-SNAPSHOT
[INFO] ------------------------------------------------------------------------
[INFO] 
[INFO] --- maven-clean-plugin:2.4.1:clean (default-clean) @ hive-smoke ---
[INFO] Deleting <https://builds.apache.org/job/Bigtop-trunk-testartifacts/ws/bigtop-tests/test-artifacts/hive/target>
[INFO] 
[INFO] --- groovy-eclipse-compiler:2.7.0-01:add-groovy-build-paths (default-add-groovy-build-paths)
@ hive-smoke ---
[INFO] Adding /src/main/groovy to the list of source folders
[INFO] Adding /src/test/groovy to the list of test source folders
[INFO] 
[INFO] --- maven-remote-resources-plugin:1.1:process (default) @ hive-smoke ---
[INFO] 
[INFO] --- maven-resources-plugin:2.4.3:resources (default-resources) @ hive-smoke ---
[INFO] Using 'UTF-8' encoding to copy filtered resources.
[INFO] Copying 120 resources
[INFO] Copying 3 resources
[INFO] 
[INFO] --- maven-compiler-plugin:2.3.2:compile (default-compile) @ hive-smoke ---
[INFO] Using Groovy-Eclipse compiler to compile both Java and Groovy files
[INFO] 
[INFO] --- maven-resources-plugin:2.4.3:testResources (default-testResources) @ hive-smoke
---
[INFO] Using 'UTF-8' encoding to copy filtered resources.
[INFO] skip non existing resourceDirectory <https://builds.apache.org/job/Bigtop-trunk-testartifacts/ws/bigtop-tests/test-artifacts/hive/src/test/resources>
[INFO] Copying 3 resources
[INFO] 
[INFO] --- maven-compiler-plugin:2.3.2:testCompile (default-testCompile) @ hive-smoke ---
[INFO] No sources to compile
[INFO] 
[INFO] --- maven-surefire-plugin:2.7:test (default-test) @ hive-smoke ---
[INFO] Tests are skipped.
[INFO] 
[INFO] --- maven-jar-plugin:2.2:jar (default-jar) @ hive-smoke ---
[INFO] Building jar: <https://builds.apache.org/job/Bigtop-trunk-testartifacts/ws/bigtop-tests/test-artifacts/hive/target/hive-smoke-0.8.0-SNAPSHOT.jar>
[INFO] 
[INFO] --- maven-failsafe-plugin:2.7.1:integration-test (integration-test) @ hive-smoke ---
[INFO] No tests to run.
[JENKINS] Recording test results[INFO] 
[INFO] --- maven-failsafe-plugin:2.7.1:verify (verify) @ hive-smoke ---
[INFO] No tests to run.

[INFO] 
[JENKINS] Recording test results[INFO] --- maven-install-plugin:2.3:install (default-install)
@ hive-smoke ---
[INFO] Installing <https://builds.apache.org/job/Bigtop-trunk-testartifacts/ws/bigtop-tests/test-artifacts/hive/target/hive-smoke-0.8.0-SNAPSHOT.jar>
to /home/jenkins/jenkins-slave/maven-repositories/1/org/apache/bigtop/itest/hive-smoke/0.8.0-SNAPSHOT/hive-smoke-0.8.0-SNAPSHOT.jar

[INFO] Installing <https://builds.apache.org/job/Bigtop-trunk-testartifacts/ws/bigtop-tests/test-artifacts/hive/pom.xml>
to /home/jenkins/jenkins-slave/maven-repositories/1/org/apache/bigtop/itest/hive-smoke/0.8.0-SNAPSHOT/hive-smoke-0.8.0-SNAPSHOT.pom
[INFO] 
[INFO] --- maven-deploy-plugin:2.5:deploy (default-deploy) @ hive-smoke ---
Downloading: https://repository.apache.org/content/repositories/snapshots/org/apache/bigtop/itest/hive-smoke/0.8.0-SNAPSHOT/maven-metadata.xml
Downloaded: https://repository.apache.org/content/repositories/snapshots/org/apache/bigtop/itest/hive-smoke/0.8.0-SNAPSHOT/maven-metadata.xml
(786 B at 2.0 KB/sec)
Uploading: https://repository.apache.org/content/repositories/snapshots/org/apache/bigtop/itest/hive-smoke/0.8.0-SNAPSHOT/hive-smoke-0.8.0-20140529.161146-25.jar
Uploaded: https://repository.apache.org/content/repositories/snapshots/org/apache/bigtop/itest/hive-smoke/0.8.0-SNAPSHOT/hive-smoke-0.8.0-20140529.161146-25.jar
(137 KB at 302.3 KB/sec)
Uploading: https://repository.apache.org/content/repositories/snapshots/org/apache/bigtop/itest/hive-smoke/0.8.0-SNAPSHOT/hive-smoke-0.8.0-20140529.161146-25.pom
Uploaded: https://repository.apache.org/content/repositories/snapshots/org/apache/bigtop/itest/hive-smoke/0.8.0-SNAPSHOT/hive-smoke-0.8.0-20140529.161146-25.pom
(2 KB at 4.0 KB/sec)
Downloading: https://repository.apache.org/content/repositories/snapshots/org/apache/bigtop/itest/hive-smoke/maven-metadata.xml
Downloaded: https://repository.apache.org/content/repositories/snapshots/org/apache/bigtop/itest/hive-smoke/maven-metadata.xml
(404 B at 1.4 KB/sec)
Uploading: https://repository.apache.org/content/repositories/snapshots/org/apache/bigtop/itest/hive-smoke/0.8.0-SNAPSHOT/maven-metadata.xml
Uploaded: https://repository.apache.org/content/repositories/snapshots/org/apache/bigtop/itest/hive-smoke/0.8.0-SNAPSHOT/maven-metadata.xml
(786 B at 2.1 KB/sec)
Uploading: https://repository.apache.org/content/repositories/snapshots/org/apache/bigtop/itest/hive-smoke/maven-metadata.xml
Uploaded: https://repository.apache.org/content/repositories/snapshots/org/apache/bigtop/itest/hive-smoke/maven-metadata.xml
(404 B at 1.0 KB/sec)
[INFO]                                                                         
[INFO] ------------------------------------------------------------------------
[INFO] Building hbasesmoke 0.8.0-SNAPSHOT
[INFO] ------------------------------------------------------------------------
Downloading: http://repo.maven.apache.org/maven2/org/apache/hbase/hbase-common/0.94.11/hbase-common-0.94.11.pom
[WARNING] The POM for org.apache.hbase:hbase-common:jar:0.94.11 is missing, no dependency
information available
Downloading: http://repo.maven.apache.org/maven2/org/apache/hbase/hbase-common/0.94.11/hbase-common-0.94.11.pom
[WARNING] The POM for org.apache.hbase:hbase-common:jar:tests:0.94.11 is missing, no dependency
information available
Downloading: http://repo.maven.apache.org/maven2/org/apache/hbase/hbase-server/0.94.11/hbase-server-0.94.11.pom
[WARNING] The POM for org.apache.hbase:hbase-server:jar:0.94.11 is missing, no dependency
information available
Downloading: http://repo.maven.apache.org/maven2/org/apache/hbase/hbase-server/0.94.11/hbase-server-0.94.11.pom
[WARNING] The POM for org.apache.hbase:hbase-server:jar:tests:0.94.11 is missing, no dependency
information available
Downloading: http://repo.maven.apache.org/maven2/org/apache/hbase/hbase-common/0.94.11/hbase-common-0.94.11.jar
Downloading: http://repo.maven.apache.org/maven2/org/apache/hbase/hbase-common/0.94.11/hbase-common-0.94.11-tests.jar
Downloading: http://repo.maven.apache.org/maven2/org/apache/hbase/hbase-server/0.94.11/hbase-server-0.94.11.jar
Downloading: http://repo.maven.apache.org/maven2/org/apache/hbase/hbase-server/0.94.11/hbase-server-0.94.11-tests.jar
[INFO] ------------------------------------------------------------------------
[INFO] Reactor Summary:
[INFO] 
[INFO] bigtop-smokes ..................................... SUCCESS [39.302s]
[INFO] hadoopsmoke ....................................... SUCCESS [13.887s]
[INFO] packagesmoke ...................................... SUCCESS [13.569s]
[INFO] httpfssmokes ...................................... SUCCESS [5.824s]
[INFO] ooziesmoke ........................................ SUCCESS [5.907s]
[INFO] hivesmoke ......................................... SUCCESS [5.472s]
[INFO] hbasesmoke ........................................ FAILURE [2.495s]
[INFO] flumesmoke ........................................ SKIPPED
[INFO] sqoopsmokes ....................................... SKIPPED
[INFO] mahoutsmoke ....................................... SKIPPED
[INFO] giraphsmoke ....................................... SKIPPED
[INFO] huesmoke .......................................... SKIPPED
[INFO] solrsmoke ......................................... SKIPPED
[INFO] crunchsmoke ....................................... SKIPPED
[INFO] datafusmoke ....................................... SKIPPED
[INFO] fatjar ............................................ SKIPPED
[INFO] io-longevity ...................................... SKIPPED
[INFO] hcatalogsmoke ..................................... SKIPPED
[INFO] sparksmoke ........................................ SKIPPED
[INFO] phoenixsmoke ...................................... SKIPPED
[INFO] ------------------------------------------------------------------------
[INFO] BUILD FAILURE
[INFO] ------------------------------------------------------------------------
[INFO] Total time: 1:43.538s
[INFO] Finished at: Thu May 29 16:11:53 UTC 2014
[INFO] Final Memory: 24M/88M
[INFO] ------------------------------------------------------------------------
Waiting for Jenkins to finish collecting data
[ERROR] Failed to execute goal on project hbase-smoke: Could not resolve dependencies for
project org.apache.bigtop.itest:hbase-smoke:jar:0.8.0-SNAPSHOT: The following artifacts could
not be resolved: org.apache.hbase:hbase-common:jar:0.94.11, org.apache.hbase:hbase-common:jar:tests:0.94.11,
org.apache.hbase:hbase-server:jar:0.94.11, org.apache.hbase:hbase-server:jar:tests:0.94.11:
Could not find artifact org.apache.hbase:hbase-common:jar:0.94.11 in central (http://repo.maven.apache.org/maven2)
-> [Help 1]
[ERROR] 
[ERROR] To see the full stack trace of the errors, re-run Maven with the -e switch.
[ERROR] Re-run Maven using the -X switch to enable full debug logging.
[ERROR] 
[ERROR] For more information about the errors and possible solutions, please read the following
articles:
[ERROR] [Help 1] http://cwiki.apache.org/confluence/display/MAVEN/DependencyResolutionException
[ERROR] 
[ERROR] After correcting the problems, you can resume the build with the command
[ERROR]   mvn <goals> -rf :hbase-smoke
[JENKINS] Archiving <https://builds.apache.org/job/Bigtop-trunk-testartifacts/ws/bigtop-tests/test-artifacts/pom.xml>
to org.apache.bigtop.itest/bigtop-smokes/0.8.0-SNAPSHOT/bigtop-smokes-0.8.0-SNAPSHOT.pom
[JENKINS] Archiving <https://builds.apache.org/job/Bigtop-trunk-testartifacts/ws/bigtop-tests/test-artifacts/sqoop/pom.xml>
to org.apache.bigtop.itest/sqoop-smoke/0.8.0-SNAPSHOT/sqoop-smoke-0.8.0-SNAPSHOT.pom
[JENKINS] Archiving <https://builds.apache.org/job/Bigtop-trunk-testartifacts/ws/bigtop-tests/test-artifacts/hue/pom.xml>
to org.apache.bigtop.itest/hue-smoke/0.8.0-SNAPSHOT/hue-smoke-0.8.0-SNAPSHOT.pom
[JENKINS] Archiving <https://builds.apache.org/job/Bigtop-trunk-testartifacts/ws/bigtop-tests/test-artifacts/crunch/pom.xml>
to org.apache.bigtop.itest/crunch-smoke/0.8.0-SNAPSHOT/crunch-smoke-0.8.0-SNAPSHOT.pom
[JENKINS] Archiving <https://builds.apache.org/job/Bigtop-trunk-testartifacts/ws/bigtop-tests/test-artifacts/package/pom.xml>
to org.apache.bigtop.itest/package-smoke/0.8.0-SNAPSHOT/package-smoke-0.8.0-SNAPSHOT.pom
[JENKINS] Archiving <https://builds.apache.org/job/Bigtop-trunk-testartifacts/ws/bigtop-tests/test-artifacts/package/target/package-smoke-0.8.0-SNAPSHOT.jar>
to org.apache.bigtop.itest/package-smoke/0.8.0-20140529.161123-25/package-smoke-0.8.0-20140529.161123-25.jar
[JENKINS] Archiving <https://builds.apache.org/job/Bigtop-trunk-testartifacts/ws/bigtop-tests/test-artifacts/hive/pom.xml>
to org.apache.bigtop.itest/hive-smoke/0.8.0-SNAPSHOT/hive-smoke-0.8.0-SNAPSHOT.pom
[JENKINS] Archiving <https://builds.apache.org/job/Bigtop-trunk-testartifacts/ws/bigtop-tests/test-artifacts/hive/target/hive-smoke-0.8.0-SNAPSHOT.jar>
to org.apache.bigtop.itest/hive-smoke/0.8.0-20140529.161146-25/hive-smoke-0.8.0-20140529.161146-25.jar
[JENKINS] Archiving <https://builds.apache.org/job/Bigtop-trunk-testartifacts/ws/bigtop-tests/test-artifacts/flume/pom.xml>
to org.apache.bigtop.itest/flume-smoke/0.8.0-SNAPSHOT/flume-smoke-0.8.0-SNAPSHOT.pom
[JENKINS] Archiving <https://builds.apache.org/job/Bigtop-trunk-testartifacts/ws/bigtop-tests/test-artifacts/httpfs/pom.xml>
to org.apache.bigtop.itest/httpfs-smoke/0.8.0-SNAPSHOT/httpfs-smoke-0.8.0-SNAPSHOT.pom
[JENKINS] Archiving <https://builds.apache.org/job/Bigtop-trunk-testartifacts/ws/bigtop-tests/test-artifacts/httpfs/target/httpfs-smoke-0.8.0-SNAPSHOT.jar>
to org.apache.bigtop.itest/httpfs-smoke/0.8.0-20140529.161131-7/httpfs-smoke-0.8.0-20140529.161131-7.jar
[JENKINS] Archiving <https://builds.apache.org/job/Bigtop-trunk-testartifacts/ws/bigtop-tests/test-artifacts/spark/pom.xml>
to org.apache.bigtop.itest/spark-smoke/0.8.0-SNAPSHOT/spark-smoke-0.8.0-SNAPSHOT.pom
[JENKINS] Archiving <https://builds.apache.org/job/Bigtop-trunk-testartifacts/ws/bigtop-tests/test-artifacts/hadoop/pom.xml>
to org.apache.bigtop.itest/hadoop-smoke/0.8.0-SNAPSHOT/hadoop-smoke-0.8.0-SNAPSHOT.pom
[JENKINS] Archiving <https://builds.apache.org/job/Bigtop-trunk-testartifacts/ws/bigtop-tests/test-artifacts/hadoop/target/hadoop-smoke-0.8.0-SNAPSHOT.jar>
to org.apache.bigtop.itest/hadoop-smoke/0.8.0-20140529.161109-25/hadoop-smoke-0.8.0-20140529.161109-25.jar
[JENKINS] Archiving <https://builds.apache.org/job/Bigtop-trunk-testartifacts/ws/bigtop-tests/test-artifacts/oozie/pom.xml>
to org.apache.bigtop.itest/oozie-smoke/0.8.0-SNAPSHOT/oozie-smoke-0.8.0-SNAPSHOT.pom
[JENKINS] Archiving <https://builds.apache.org/job/Bigtop-trunk-testartifacts/ws/bigtop-tests/test-artifacts/oozie/target/oozie-smoke-0.8.0-SNAPSHOT.jar>
to org.apache.bigtop.itest/oozie-smoke/0.8.0-20140529.161139-25/oozie-smoke-0.8.0-20140529.161139-25.jar
[JENKINS] Archiving <https://builds.apache.org/job/Bigtop-trunk-testartifacts/ws/bigtop-tests/test-artifacts/giraph/pom.xml>
to org.apache.bigtop.itest/giraph-smoke/0.8.0-SNAPSHOT/giraph-smoke-0.8.0-SNAPSHOT.pom
[JENKINS] Archiving <https://builds.apache.org/job/Bigtop-trunk-testartifacts/ws/bigtop-tests/test-artifacts/hcatalog/pom.xml>
to org.apache.bigtop.itest/hcatalog-smoke/0.8.0-SNAPSHOT/hcatalog-smoke-0.8.0-SNAPSHOT.pom
[JENKINS] Archiving <https://builds.apache.org/job/Bigtop-trunk-testartifacts/ws/bigtop-tests/test-artifacts/datafu/pom.xml>
to org.apache.bigtop.itest/datafu-smoke/0.8.0-SNAPSHOT/datafu-smoke-0.8.0-SNAPSHOT.pom
[JENKINS] Archiving <https://builds.apache.org/job/Bigtop-trunk-testartifacts/ws/bigtop-tests/test-artifacts/longevity/pom.xml>
to org.apache.bigtop.itest/io-longevity/0.8.0-SNAPSHOT/io-longevity-0.8.0-SNAPSHOT.pom
[JENKINS] Archiving <https://builds.apache.org/job/Bigtop-trunk-testartifacts/ws/bigtop-tests/test-artifacts/mahout/pom.xml>
to org.apache.bigtop.itest/mahout-smoke/0.8.0-SNAPSHOT/mahout-smoke-0.8.0-SNAPSHOT.pom
[JENKINS] Archiving <https://builds.apache.org/job/Bigtop-trunk-testartifacts/ws/bigtop-tests/test-artifacts/solr/pom.xml>
to org.apache.bigtop.itest/solr-smoke/0.8.0-SNAPSHOT/solr-smoke-0.8.0-SNAPSHOT.pom
[JENKINS] Archiving <https://builds.apache.org/job/Bigtop-trunk-testartifacts/ws/bigtop-tests/test-artifacts/hbase/pom.xml>
to org.apache.bigtop.itest/hbase-smoke/0.8.0-SNAPSHOT/hbase-smoke-0.8.0-SNAPSHOT.pom
[JENKINS] Archiving <https://builds.apache.org/job/Bigtop-trunk-testartifacts/ws/bigtop-tests/test-artifacts/phoenix/pom.xml>
to org.apache.bigtop.itest/phoenix-smoke/0.8.0-SNAPSHOT/phoenix-smoke-0.8.0-SNAPSHOT.pom
[JENKINS] Archiving <https://builds.apache.org/job/Bigtop-trunk-testartifacts/ws/bigtop-tests/test-artifacts/fatjar/pom.xml>
to org.apache.bigtop.itest/fat-smoke/0.8.0-SNAPSHOT/fat-smoke-0.8.0-SNAPSHOT.pom
Sending e-mails to: ci@bigtop.apache.org
channel stopped

Mime
View raw message