bigtop-ci mailing list archives

Site index · List index
Message view « Date » · « Thread »
Top « Date » · « Thread »
From Apache Jenkins Server <jenk...@builds.apache.org>
Subject Build failed in Jenkins: Bigtop-trunk-test-execution #930
Date Sat, 19 Oct 2013 07:11:42 GMT
See <https://builds.apache.org/job/Bigtop-trunk-test-execution/930/changes>

Changes:

[rvs] BIGTOP-1123. update licensing for the Bigtop 0.7.0 release

------------------------------------------
[...truncated 3 lines...]
Started by an SCM change
Started by an SCM change
Started by an SCM change
Started by an SCM change
Started by an SCM change
Started by an SCM change
Started by an SCM change
Started by an SCM change
Started by an SCM change
Building remotely on ubuntu1 in workspace <https://builds.apache.org/job/Bigtop-trunk-test-execution/ws/>
Checkout:Bigtop-trunk-test-execution / <https://builds.apache.org/job/Bigtop-trunk-test-execution/ws/>
- hudson.remoting.Channel@2b4203dd:ubuntu1
Using strategy: Default
Last Built Revision: Revision f2d6ee32961a4d4a1cd13389f305d258c32c2d09 (origin/master)
Fetching changes from 1 remote Git repository
Fetching upstream changes from origin
Commencing build of Revision 8143f75f1991f2aab36ecec7136df7e12ae9d73a (origin/master)
Checking out Revision 8143f75f1991f2aab36ecec7136df7e12ae9d73a (origin/master)
[Bigtop-trunk-test-execution] $ /bin/bash -xe /tmp/hudson53178340550442485.sh
+ export HADOOP_CONF_DIR=
+ HADOOP_CONF_DIR=
+ export HADOOP_HOME=
+ HADOOP_HOME=
+ /home/hudson/tools/maven/latest3/bin/mvn -f bigtop-tests/test-execution/pom.xml -DskipTests
-DskipITs deploy -DrepositoryId=apache.snapshots.https
[INFO] Scanning for projects...
[INFO] ------------------------------------------------------------------------
[INFO] Reactor Build Order:
[INFO] 
[INFO] stacks-validation-common
[INFO] smoke-tests-conf
[INFO] packagesmokes
[INFO] bigtop-smokes
[INFO]                                                                         
[INFO] ------------------------------------------------------------------------
[INFO] Building stacks-validation-common 0.8.0-SNAPSHOT
[INFO] ------------------------------------------------------------------------
[INFO] 
[INFO] --- maven-remote-resources-plugin:1.1:process (default) @ stacks-common ---
[INFO] Setting property: classpath.resource.loader.class => 'org.codehaus.plexus.velocity.ContextClassLoaderResourceLoader'.
[INFO] Setting property: velocimacro.messages.on => 'false'.
[INFO] Setting property: resource.loader => 'classpath'.
[INFO] Setting property: resource.manager.logwhenfound => 'false'.
[INFO] 
[INFO] --- maven-install-plugin:2.3:install (default-install) @ stacks-common ---
[INFO] Installing <https://builds.apache.org/job/Bigtop-trunk-test-execution/ws/bigtop-tests/test-execution/common/pom.xml>
to /home/jenkins/.m2/repository/org/apache/bigtop/itest/stacks-common/0.8.0-SNAPSHOT/stacks-common-0.8.0-SNAPSHOT.pom
[INFO] 
[INFO] --- maven-deploy-plugin:2.5:deploy (default-deploy) @ stacks-common ---
Downloading: https://repository.apache.org/content/repositories/snapshots/org/apache/bigtop/itest/stacks-common/0.8.0-SNAPSHOT/maven-metadata.xml
613 B   
        
Downloaded: https://repository.apache.org/content/repositories/snapshots/org/apache/bigtop/itest/stacks-common/0.8.0-SNAPSHOT/maven-metadata.xml
(613 B at 0.6 KB/sec)
Uploading: https://repository.apache.org/content/repositories/snapshots/org/apache/bigtop/itest/stacks-common/0.8.0-SNAPSHOT/stacks-common-0.8.0-20131019.071133-2.pom
2/12 KB   
4/12 KB   
6/12 KB   
8/12 KB   
10/12 KB   
12/12 KB   
           
Uploaded: https://repository.apache.org/content/repositories/snapshots/org/apache/bigtop/itest/stacks-common/0.8.0-SNAPSHOT/stacks-common-0.8.0-20131019.071133-2.pom
(12 KB at 27.9 KB/sec)
Downloading: https://repository.apache.org/content/repositories/snapshots/org/apache/bigtop/itest/stacks-common/maven-metadata.xml
447 B      
        
Downloaded: https://repository.apache.org/content/repositories/snapshots/org/apache/bigtop/itest/stacks-common/maven-metadata.xml
(447 B at 0.6 KB/sec)
Uploading: https://repository.apache.org/content/repositories/snapshots/org/apache/bigtop/itest/stacks-common/0.8.0-SNAPSHOT/maven-metadata.xml
613/613 B   
            
Uploaded: https://repository.apache.org/content/repositories/snapshots/org/apache/bigtop/itest/stacks-common/0.8.0-SNAPSHOT/maven-metadata.xml
(613 B at 1.1 KB/sec)
Uploading: https://repository.apache.org/content/repositories/snapshots/org/apache/bigtop/itest/stacks-common/maven-metadata.xml
447/447 B   
            
Uploaded: https://repository.apache.org/content/repositories/snapshots/org/apache/bigtop/itest/stacks-common/maven-metadata.xml
(447 B at 0.6 KB/sec)
[INFO]                                                                         
[INFO] ------------------------------------------------------------------------
[INFO] Building smoke-tests-conf 0.8.0-SNAPSHOT
[INFO] ------------------------------------------------------------------------
[INFO] 
[INFO] --- maven-remote-resources-plugin:1.1:process (default) @ smoke-tests-conf ---
[INFO] 
[INFO] --- maven-resources-plugin:2.4:resources (default-resources) @ smoke-tests-conf ---
[INFO] Using 'UTF-8' encoding to copy filtered resources.
[INFO] Copying 1 resource
[INFO] Copying 3 resources
[INFO] 
[INFO] --- maven-compiler-plugin:2.0.2:compile (default-compile) @ smoke-tests-conf ---
[INFO] No sources to compile
[INFO] 
[INFO] --- maven-resources-plugin:2.4:testResources (default-testResources) @ smoke-tests-conf
---
[INFO] Using 'UTF-8' encoding to copy filtered resources.
[INFO] skip non existing resourceDirectory <https://builds.apache.org/job/Bigtop-trunk-test-execution/ws/bigtop-tests/test-execution/conf/src/test/resources>
[INFO] Copying 3 resources
[INFO] 
[INFO] --- maven-compiler-plugin:2.0.2:testCompile (default-testCompile) @ smoke-tests-conf
---
[INFO] No sources to compile
[INFO] 
[INFO] --- maven-surefire-plugin:2.11:test (default-test) @ smoke-tests-conf ---
[INFO] Tests are skipped.
[INFO] 
[INFO] --- maven-jar-plugin:2.3:jar (default-jar) @ smoke-tests-conf ---
[INFO] Building jar: <https://builds.apache.org/job/Bigtop-trunk-test-execution/ws/bigtop-tests/test-execution/conf/target/smoke-tests-conf-0.8.0-SNAPSHOT.jar>
[INFO] 
[INFO] --- maven-install-plugin:2.3:install (default-install) @ smoke-tests-conf ---
[INFO] Installing <https://builds.apache.org/job/Bigtop-trunk-test-execution/ws/bigtop-tests/test-execution/conf/target/smoke-tests-conf-0.8.0-SNAPSHOT.jar>
to /home/jenkins/.m2/repository/org/apache/bigtop/itest/smoke-tests-conf/0.8.0-SNAPSHOT/smoke-tests-conf-0.8.0-SNAPSHOT.jar
[INFO] Installing <https://builds.apache.org/job/Bigtop-trunk-test-execution/ws/bigtop-tests/test-execution/conf/pom.xml>
to /home/jenkins/.m2/repository/org/apache/bigtop/itest/smoke-tests-conf/0.8.0-SNAPSHOT/smoke-tests-conf-0.8.0-SNAPSHOT.pom
[INFO] 
[INFO] --- maven-deploy-plugin:2.5:deploy (default-deploy) @ smoke-tests-conf ---
Downloading: https://repository.apache.org/content/repositories/snapshots/org/apache/bigtop/itest/smoke-tests-conf/0.8.0-SNAPSHOT/maven-metadata.xml
789 B       
        
Downloaded: https://repository.apache.org/content/repositories/snapshots/org/apache/bigtop/itest/smoke-tests-conf/0.8.0-SNAPSHOT/maven-metadata.xml
(789 B at 2.4 KB/sec)
Uploading: https://repository.apache.org/content/repositories/snapshots/org/apache/bigtop/itest/smoke-tests-conf/0.8.0-SNAPSHOT/smoke-tests-conf-0.8.0-20131019.071137-2.jar
2/8 KB   
4/8 KB   
6/8 KB   
8/8 KB   
         
Uploaded: https://repository.apache.org/content/repositories/snapshots/org/apache/bigtop/itest/smoke-tests-conf/0.8.0-SNAPSHOT/smoke-tests-conf-0.8.0-20131019.071137-2.jar
(8 KB at 21.2 KB/sec)
Uploading: https://repository.apache.org/content/repositories/snapshots/org/apache/bigtop/itest/smoke-tests-conf/0.8.0-SNAPSHOT/smoke-tests-conf-0.8.0-20131019.071137-2.pom
2/2 KB   
         
Uploaded: https://repository.apache.org/content/repositories/snapshots/org/apache/bigtop/itest/smoke-tests-conf/0.8.0-SNAPSHOT/smoke-tests-conf-0.8.0-20131019.071137-2.pom
(2 KB at 2.7 KB/sec)
Downloading: https://repository.apache.org/content/repositories/snapshots/org/apache/bigtop/itest/smoke-tests-conf/maven-metadata.xml
450 B    
        
Downloaded: https://repository.apache.org/content/repositories/snapshots/org/apache/bigtop/itest/smoke-tests-conf/maven-metadata.xml
(450 B at 1.5 KB/sec)
Uploading: https://repository.apache.org/content/repositories/snapshots/org/apache/bigtop/itest/smoke-tests-conf/0.8.0-SNAPSHOT/maven-metadata.xml
789/789 B   
            
Uploaded: https://repository.apache.org/content/repositories/snapshots/org/apache/bigtop/itest/smoke-tests-conf/0.8.0-SNAPSHOT/maven-metadata.xml
(789 B at 2.0 KB/sec)
Uploading: https://repository.apache.org/content/repositories/snapshots/org/apache/bigtop/itest/smoke-tests-conf/maven-metadata.xml
450/450 B   
            
Uploaded: https://repository.apache.org/content/repositories/snapshots/org/apache/bigtop/itest/smoke-tests-conf/maven-metadata.xml
(450 B at 1.1 KB/sec)
[INFO]                                                                         
[INFO] ------------------------------------------------------------------------
[INFO] Building packagesmokes 0.8.0-SNAPSHOT
[INFO] ------------------------------------------------------------------------
Downloading: http://repository.apache.org/snapshots/org/apache/bigtop/itest/package-smoke/0.8.0-SNAPSHOT/maven-metadata.xml
            
Downloading: http://repository.apache.org/snapshots/org/apache/bigtop/itest/package-smoke/0.8.0-SNAPSHOT/package-smoke-0.8.0-SNAPSHOT.pom
            
[WARNING] The POM for org.apache.bigtop.itest:package-smoke:jar:0.8.0-SNAPSHOT is missing,
no dependency information available
Downloading: http://repository.apache.org/snapshots/org/apache/bigtop/itest/itest-common/0.8.0-SNAPSHOT/maven-metadata.xml
997 B       
        
Downloaded: http://repository.apache.org/snapshots/org/apache/bigtop/itest/itest-common/0.8.0-SNAPSHOT/maven-metadata.xml
(997 B at 1.8 KB/sec)
Downloading: http://repository.apache.org/snapshots/org/apache/bigtop/itest/itest-common/0.8.0-SNAPSHOT/itest-common-0.8.0-20131018.222926-1.pom
819 B   
4 KB    
5 KB   
       
Downloaded: http://repository.apache.org/snapshots/org/apache/bigtop/itest/itest-common/0.8.0-SNAPSHOT/itest-common-0.8.0-20131018.222926-1.pom
(5 KB at 20.4 KB/sec)
Downloading: http://repository.apache.org/snapshots/org/apache/bigtop/bigtop/0.8.0-SNAPSHOT/maven-metadata.xml
600 B   
        
Downloaded: http://repository.apache.org/snapshots/org/apache/bigtop/bigtop/0.8.0-SNAPSHOT/maven-metadata.xml
(600 B at 1.0 KB/sec)
Downloading: http://repository.apache.org/snapshots/org/apache/bigtop/bigtop/0.8.0-SNAPSHOT/bigtop-0.8.0-20131018.221946-1.pom
774 B   
3 KB    
7 KB   
8 KB   
10 KB   
13 KB   
14 KB   
        
Downloaded: http://repository.apache.org/snapshots/org/apache/bigtop/bigtop/0.8.0-SNAPSHOT/bigtop-0.8.0-20131018.221946-1.pom
(14 KB at 64.3 KB/sec)
Downloading: http://repository.apache.org/snapshots/org/apache/bigtop/itest/package-smoke/0.8.0-SNAPSHOT/package-smoke-0.8.0-SNAPSHOT.jar
Downloading: http://repository.apache.org/snapshots/org/apache/bigtop/itest/itest-common/0.8.0-SNAPSHOT/itest-common-0.8.0-20131018.222926-1.jar
        
1/180 KB   
5/180 KB   
9/180 KB   
13/180 KB   
14/180 KB   
18/180 KB   
21/180 KB   
25/180 KB   
29/180 KB   
30/180 KB   
34/180 KB   
38/180 KB   
42/180 KB   
46/180 KB   
49/180 KB   
52/180 KB   
56/180 KB   
60/180 KB   
64/180 KB   
68/180 KB   
69/180 KB   
70/180 KB   
74/180 KB   
78/180 KB   
81/180 KB   
85/180 KB   
89/180 KB   
93/180 KB   
97/180 KB   
101/180 KB   
103/180 KB   
107/180 KB   
108/180 KB   
110/180 KB   
114/180 KB   
118/180 KB   
122/180 KB   
126/180 KB   
128/180 KB   
131/180 KB   
135/180 KB   
139/180 KB   
143/180 KB   
147/180 KB   
151/180 KB   
155/180 KB   
159/180 KB   
163/180 KB   
167/180 KB   
168/180 KB   
172/180 KB   
176/180 KB   
180/180 KB   
180/180 KB   
             
Downloaded: http://repository.apache.org/snapshots/org/apache/bigtop/itest/itest-common/0.8.0-SNAPSHOT/itest-common-0.8.0-20131018.222926-1.jar
(180 KB at 407.3 KB/sec)
[INFO] ------------------------------------------------------------------------
[INFO] Reactor Summary:
[INFO] 
[INFO] stacks-validation-common .......................... SUCCESS [6.315s]
[INFO] smoke-tests-conf .................................. SUCCESS [3.768s]
[INFO] packagesmokes ..................................... FAILURE [2.810s]
[INFO] bigtop-smokes ..................................... SKIPPED
[INFO] ------------------------------------------------------------------------
[INFO] BUILD FAILURE
[INFO] ------------------------------------------------------------------------
[INFO] Total time: 13.826s
[INFO] Finished at: Sat Oct 19 07:11:42 UTC 2013
[INFO] Final Memory: 13M/109M
[INFO] ------------------------------------------------------------------------
[ERROR] Failed to execute goal on project package-smoke-execution: Could not resolve dependencies
for project org.apache.bigtop.itest:package-smoke-execution:jar:0.8.0-SNAPSHOT: Could not
find artifact org.apache.bigtop.itest:package-smoke:jar:0.8.0-SNAPSHOT in Nexus (http://repository.apache.org/snapshots)
-> [Help 1]
[ERROR] 
[ERROR] To see the full stack trace of the errors, re-run Maven with the -e switch.
[ERROR] Re-run Maven using the -X switch to enable full debug logging.
[ERROR] 
[ERROR] For more information about the errors and possible solutions, please read the following
articles:
[ERROR] [Help 1] http://cwiki.apache.org/confluence/display/MAVEN/DependencyResolutionException
[ERROR] 
[ERROR] After correcting the problems, you can resume the build with the command
[ERROR]   mvn <goals> -rf :package-smoke-execution
Build step 'Execute shell' marked build as failure

Mime
View raw message