bigtop-ci mailing list archives

Site index · List index
Message view « Date » · « Thread »
Top « Date » · « Thread »
From Apache Jenkins Server <jenk...@builds.apache.org>
Subject Build failed in Jenkins: Bigtop-trunk-test-execution #929
Date Fri, 18 Oct 2013 22:18:32 GMT
See <https://builds.apache.org/job/Bigtop-trunk-test-execution/929/changes>

Changes:

[mackrorysd] Addendum to BIGTOP-1096. Correcting location of Oozie Tomcat deployment on Debian

[rvs] Bigtop 0.7.0 release: updating documentation

[rvs] Opening up Bigtop 0.8.0 development

------------------------------------------
Started by an SCM change
Started by an SCM change
Started by an SCM change
Started by an SCM change
Started by an SCM change
Started by an SCM change
Started by an SCM change
Started by an SCM change
Started by an SCM change
Started by an SCM change
Started by an SCM change
Started by an SCM change
Started by an SCM change
Started by an SCM change
Started by an SCM change
Started by an SCM change
Building remotely on ubuntu4 in workspace <https://builds.apache.org/job/Bigtop-trunk-test-execution/ws/>
Checkout:Bigtop-trunk-test-execution / <https://builds.apache.org/job/Bigtop-trunk-test-execution/ws/>
- hudson.remoting.Channel@f7bd7:ubuntu4
Using strategy: Default
Last Built Revision: Revision d1ca16874acbe7ae75aaa7f2c9565e10b38f1a48 (origin/master)
Fetching changes from 1 remote Git repository
Fetching upstream changes from origin
Commencing build of Revision f2d6ee32961a4d4a1cd13389f305d258c32c2d09 (origin/master)
Checking out Revision f2d6ee32961a4d4a1cd13389f305d258c32c2d09 (origin/master)
[Bigtop-trunk-test-execution] $ /bin/bash -xe /tmp/hudson18872013638588002.sh
+ export HADOOP_CONF_DIR=
+ HADOOP_CONF_DIR=
+ export HADOOP_HOME=
+ HADOOP_HOME=
+ /home/hudson/tools/maven/latest3/bin/mvn -f bigtop-tests/test-execution/pom.xml -DskipTests
-DskipITs deploy -DrepositoryId=apache.snapshots.https
[INFO] Scanning for projects...
[INFO] ------------------------------------------------------------------------
[INFO] Reactor Build Order:
[INFO] 
[INFO] stacks-validation-common
[INFO] smoke-tests-conf
[INFO] packagesmokes
[INFO] bigtop-smokes
[INFO]                                                                         
[INFO] ------------------------------------------------------------------------
[INFO] Building stacks-validation-common 0.8.0-SNAPSHOT
[INFO] ------------------------------------------------------------------------
[INFO] 
[INFO] --- maven-remote-resources-plugin:1.1:process (default) @ stacks-common ---
[INFO] Setting property: classpath.resource.loader.class => 'org.codehaus.plexus.velocity.ContextClassLoaderResourceLoader'.
[INFO] Setting property: velocimacro.messages.on => 'false'.
[INFO] Setting property: resource.loader => 'classpath'.
[INFO] Setting property: resource.manager.logwhenfound => 'false'.
[INFO] 
[INFO] --- maven-install-plugin:2.3:install (default-install) @ stacks-common ---
[INFO] Installing <https://builds.apache.org/job/Bigtop-trunk-test-execution/ws/bigtop-tests/test-execution/common/pom.xml>
to /home/jenkins/.m2/repository/org/apache/bigtop/itest/stacks-common/0.8.0-SNAPSHOT/stacks-common-0.8.0-SNAPSHOT.pom
[INFO] 
[INFO] --- maven-deploy-plugin:2.5:deploy (default-deploy) @ stacks-common ---
Downloading: https://repository.apache.org/content/repositories/snapshots/org/apache/bigtop/itest/stacks-common/0.8.0-SNAPSHOT/maven-metadata.xml

Uploading: https://repository.apache.org/content/repositories/snapshots/org/apache/bigtop/itest/stacks-common/0.8.0-SNAPSHOT/stacks-common-0.8.0-20131018.221825-1.pom
2/12 KB   
4/12 KB   
6/12 KB   
8/12 KB   
10/12 KB   
12/12 KB   
           
Uploaded: https://repository.apache.org/content/repositories/snapshots/org/apache/bigtop/itest/stacks-common/0.8.0-SNAPSHOT/stacks-common-0.8.0-20131018.221825-1.pom
(12 KB at 25.0 KB/sec)
Downloading: https://repository.apache.org/content/repositories/snapshots/org/apache/bigtop/itest/stacks-common/maven-metadata.xml
407 B      
        
Downloaded: https://repository.apache.org/content/repositories/snapshots/org/apache/bigtop/itest/stacks-common/maven-metadata.xml
(407 B at 1.6 KB/sec)
Uploading: https://repository.apache.org/content/repositories/snapshots/org/apache/bigtop/itest/stacks-common/0.8.0-SNAPSHOT/maven-metadata.xml
613/613 B   
            
Uploaded: https://repository.apache.org/content/repositories/snapshots/org/apache/bigtop/itest/stacks-common/0.8.0-SNAPSHOT/maven-metadata.xml
(613 B at 2.2 KB/sec)
Uploading: https://repository.apache.org/content/repositories/snapshots/org/apache/bigtop/itest/stacks-common/maven-metadata.xml
447/447 B   
            
Uploaded: https://repository.apache.org/content/repositories/snapshots/org/apache/bigtop/itest/stacks-common/maven-metadata.xml
(447 B at 1.1 KB/sec)
[INFO]                                                                         
[INFO] ------------------------------------------------------------------------
[INFO] Building smoke-tests-conf 0.8.0-SNAPSHOT
[INFO] ------------------------------------------------------------------------
[INFO] 
[INFO] --- maven-remote-resources-plugin:1.1:process (default) @ smoke-tests-conf ---
[INFO] 
[INFO] --- maven-resources-plugin:2.4:resources (default-resources) @ smoke-tests-conf ---
[INFO] Using 'UTF-8' encoding to copy filtered resources.
[INFO] Copying 1 resource
[INFO] Copying 3 resources
[INFO] 
[INFO] --- maven-compiler-plugin:2.0.2:compile (default-compile) @ smoke-tests-conf ---
[INFO] No sources to compile
[INFO] 
[INFO] --- maven-resources-plugin:2.4:testResources (default-testResources) @ smoke-tests-conf
---
[INFO] Using 'UTF-8' encoding to copy filtered resources.
[INFO] skip non existing resourceDirectory <https://builds.apache.org/job/Bigtop-trunk-test-execution/ws/bigtop-tests/test-execution/conf/src/test/resources>
[INFO] Copying 3 resources
[INFO] 
[INFO] --- maven-compiler-plugin:2.0.2:testCompile (default-testCompile) @ smoke-tests-conf
---
[INFO] No sources to compile
[INFO] 
[INFO] --- maven-surefire-plugin:2.11:test (default-test) @ smoke-tests-conf ---
[INFO] Tests are skipped.
[INFO] 
[INFO] --- maven-jar-plugin:2.3:jar (default-jar) @ smoke-tests-conf ---
[INFO] Building jar: <https://builds.apache.org/job/Bigtop-trunk-test-execution/ws/bigtop-tests/test-execution/conf/target/smoke-tests-conf-0.8.0-SNAPSHOT.jar>
[INFO] 
[INFO] --- maven-install-plugin:2.3:install (default-install) @ smoke-tests-conf ---
[INFO] Installing <https://builds.apache.org/job/Bigtop-trunk-test-execution/ws/bigtop-tests/test-execution/conf/target/smoke-tests-conf-0.8.0-SNAPSHOT.jar>
to /home/jenkins/.m2/repository/org/apache/bigtop/itest/smoke-tests-conf/0.8.0-SNAPSHOT/smoke-tests-conf-0.8.0-SNAPSHOT.jar
[INFO] Installing <https://builds.apache.org/job/Bigtop-trunk-test-execution/ws/bigtop-tests/test-execution/conf/pom.xml>
to /home/jenkins/.m2/repository/org/apache/bigtop/itest/smoke-tests-conf/0.8.0-SNAPSHOT/smoke-tests-conf-0.8.0-SNAPSHOT.pom
[INFO] 
[INFO] --- maven-deploy-plugin:2.5:deploy (default-deploy) @ smoke-tests-conf ---
Downloading: https://repository.apache.org/content/repositories/snapshots/org/apache/bigtop/itest/smoke-tests-conf/0.8.0-SNAPSHOT/maven-metadata.xml
            
Uploading: https://repository.apache.org/content/repositories/snapshots/org/apache/bigtop/itest/smoke-tests-conf/0.8.0-SNAPSHOT/smoke-tests-conf-0.8.0-20131018.221829-1.jar
2/8 KB      
4/8 KB   
6/8 KB   
8/8 KB   
         
Uploaded: https://repository.apache.org/content/repositories/snapshots/org/apache/bigtop/itest/smoke-tests-conf/0.8.0-SNAPSHOT/smoke-tests-conf-0.8.0-20131018.221829-1.jar
(8 KB at 18.6 KB/sec)
Uploading: https://repository.apache.org/content/repositories/snapshots/org/apache/bigtop/itest/smoke-tests-conf/0.8.0-SNAPSHOT/smoke-tests-conf-0.8.0-20131018.221829-1.pom
2/2 KB   
         
Uploaded: https://repository.apache.org/content/repositories/snapshots/org/apache/bigtop/itest/smoke-tests-conf/0.8.0-SNAPSHOT/smoke-tests-conf-0.8.0-20131018.221829-1.pom
(2 KB at 4.6 KB/sec)
Downloading: https://repository.apache.org/content/repositories/snapshots/org/apache/bigtop/itest/smoke-tests-conf/maven-metadata.xml
410 B    
        
Downloaded: https://repository.apache.org/content/repositories/snapshots/org/apache/bigtop/itest/smoke-tests-conf/maven-metadata.xml
(410 B at 1.0 KB/sec)
Uploading: https://repository.apache.org/content/repositories/snapshots/org/apache/bigtop/itest/smoke-tests-conf/0.8.0-SNAPSHOT/maven-metadata.xml
789/789 B   
            
Uploaded: https://repository.apache.org/content/repositories/snapshots/org/apache/bigtop/itest/smoke-tests-conf/0.8.0-SNAPSHOT/maven-metadata.xml
(789 B at 2.9 KB/sec)
Uploading: https://repository.apache.org/content/repositories/snapshots/org/apache/bigtop/itest/smoke-tests-conf/maven-metadata.xml
450/450 B   
            
Uploaded: https://repository.apache.org/content/repositories/snapshots/org/apache/bigtop/itest/smoke-tests-conf/maven-metadata.xml
(450 B at 1.2 KB/sec)
[INFO]                                                                         
[INFO] ------------------------------------------------------------------------
[INFO] Building packagesmokes 0.8.0-SNAPSHOT
[INFO] ------------------------------------------------------------------------
Downloading: http://repository.apache.org/snapshots/org/apache/bigtop/itest/package-smoke/0.8.0-SNAPSHOT/maven-metadata.xml
            
Downloading: http://repository.apache.org/snapshots/org/apache/bigtop/itest/package-smoke/0.8.0-SNAPSHOT/package-smoke-0.8.0-SNAPSHOT.pom
            
[WARNING] The POM for org.apache.bigtop.itest:package-smoke:jar:0.8.0-SNAPSHOT is missing,
no dependency information available
Downloading: http://repository.apache.org/snapshots/org/apache/bigtop/itest/itest-common/0.8.0-SNAPSHOT/maven-metadata.xml
            
Downloading: http://repository.apache.org/snapshots/org/apache/bigtop/itest/itest-common/0.8.0-SNAPSHOT/itest-common-0.8.0-SNAPSHOT.pom
            
[WARNING] The POM for org.apache.bigtop.itest:itest-common:jar:0.8.0-SNAPSHOT is missing,
no dependency information available
Downloading: http://repository.apache.org/snapshots/org/apache/bigtop/itest/package-smoke/0.8.0-SNAPSHOT/package-smoke-0.8.0-SNAPSHOT.jar
Downloading: http://repository.apache.org/snapshots/org/apache/bigtop/itest/itest-common/0.8.0-SNAPSHOT/itest-common-0.8.0-SNAPSHOT.jar
            
            
[INFO] ------------------------------------------------------------------------
[INFO] Reactor Summary:
[INFO] 
[INFO] stacks-validation-common .......................... SUCCESS [4.664s]
[INFO] smoke-tests-conf .................................. SUCCESS [4.217s]
[INFO] packagesmokes ..................................... FAILURE [0.869s]
[INFO] bigtop-smokes ..................................... SKIPPED
[INFO] ------------------------------------------------------------------------
[INFO] BUILD FAILURE
[INFO] ------------------------------------------------------------------------
[INFO] Total time: 10.497s
[INFO] Finished at: Fri Oct 18 22:18:32 UTC 2013
[INFO] Final Memory: 13M/109M
[INFO] ------------------------------------------------------------------------
[ERROR] Failed to execute goal on project package-smoke-execution: Could not resolve dependencies
for project org.apache.bigtop.itest:package-smoke-execution:jar:0.8.0-SNAPSHOT: The following
artifacts could not be resolved: org.apache.bigtop.itest:package-smoke:jar:0.8.0-SNAPSHOT,
org.apache.bigtop.itest:itest-common:jar:0.8.0-SNAPSHOT: Could not find artifact org.apache.bigtop.itest:package-smoke:jar:0.8.0-SNAPSHOT
in Nexus (http://repository.apache.org/snapshots) -> [Help 1]
[ERROR] 
[ERROR] To see the full stack trace of the errors, re-run Maven with the -e switch.
[ERROR] Re-run Maven using the -X switch to enable full debug logging.
[ERROR] 
[ERROR] For more information about the errors and possible solutions, please read the following
articles:
[ERROR] [Help 1] http://cwiki.apache.org/confluence/display/MAVEN/DependencyResolutionException
[ERROR] 
[ERROR] After correcting the problems, you can resume the build with the command
[ERROR]   mvn <goals> -rf :package-smoke-execution
Build step 'Execute shell' marked build as failure

Mime
View raw message