bigtop-ci mailing list archives

Site index · List index
Message view « Date » · « Thread »
Top « Date » · « Thread »
From Apache Jenkins Server <jenk...@builds.apache.org>
Subject Build failed in Jenkins: Bigtop-trunk-iTest #1486
Date Tue, 30 Jul 2013 12:18:05 GMT
See <https://builds.apache.org/job/Bigtop-trunk-iTest/1486/>

------------------------------------------
Started by an SCM change
Building remotely on ubuntu4 in workspace <https://builds.apache.org/job/Bigtop-trunk-iTest/ws/>
Checkout:Bigtop-trunk-iTest / <https://builds.apache.org/job/Bigtop-trunk-iTest/ws/>
- hudson.remoting.Channel@4e1381c9:ubuntu4
Using strategy: Default
Last Built Revision: Revision de6703ca549212c990dcc2b996dd0175b0e87d36 (origin/master)
Fetching changes from 1 remote Git repository
Fetching upstream changes from origin
Commencing build of Revision de6703ca549212c990dcc2b996dd0175b0e87d36 (origin/master)
Checking out Revision de6703ca549212c990dcc2b996dd0175b0e87d36 (origin/master)
[Bigtop-trunk-iTest] $ /bin/bash -xe /tmp/hudson7929739459196649745.sh
+ export JAVA_HOME=/home/hudson/tools/java/latest
+ JAVA_HOME=/home/hudson/tools/java/latest
+ export PATH=/home/hudson/tools/java/latest/bin:/home/hudson/tools/maven/apache-maven-3.0.4/bin:/home/hudson/tools/java/latest1.6/bin:/home/hudson/tools/java/latest1.6/bin:/usr/local/sbin:/usr/local/bin:/usr/sbin:/usr/bin:/sbin:/bin:/usr/bin/X11:/usr/games
+ PATH=/home/hudson/tools/java/latest/bin:/home/hudson/tools/maven/apache-maven-3.0.4/bin:/home/hudson/tools/java/latest1.6/bin:/home/hudson/tools/java/latest1.6/bin:/usr/local/sbin:/usr/local/bin:/usr/sbin:/usr/bin:/sbin:/bin:/usr/bin/X11:/usr/games
+ env
BUILD_URL=https://builds.apache.org/job/Bigtop-trunk-iTest/1486/
HUDSON_SERVER_COOKIE=f4ebd1e6b0d976e8
SHELL=/bin/bash
SSH_CLIENT=140.211.11.8 49711 22
BUILD_TAG=jenkins-Bigtop-trunk-iTest-1486
GIT_PREVIOUS_COMMIT=de6703ca549212c990dcc2b996dd0175b0e87d36
WORKSPACE=<https://builds.apache.org/job/Bigtop-trunk-iTest/ws/>
JOB_URL=https://builds.apache.org/job/Bigtop-trunk-iTest/
USER=jenkins
LD_LIBRARY_PATH=/usr/lib/jvm/java-6-openjdk-amd64/jre/lib/amd64/server:/usr/lib/jvm/java-6-openjdk-amd64/jre/lib/amd64:/usr/lib/jvm/java-6-openjdk-amd64/jre/../lib/amd64
GIT_COMMIT=de6703ca549212c990dcc2b996dd0175b0e87d36
JENKINS_HOME=/home/hudson/hudson
PATH=/home/hudson/tools/java/latest/bin:/home/hudson/tools/maven/apache-maven-3.0.4/bin:/home/hudson/tools/java/latest1.6/bin:/home/hudson/tools/java/latest1.6/bin:/usr/local/sbin:/usr/local/bin:/usr/sbin:/usr/bin:/sbin:/bin:/usr/bin/X11:/usr/games
MAIL=/var/mail/jenkins
MAVEN_HOME=/home/hudson/tools/maven/apache-maven-3.0.4
PWD=<https://builds.apache.org/job/Bigtop-trunk-iTest/ws/>
JAVA_HOME=/home/hudson/tools/java/latest
HUDSON_URL=https://builds.apache.org/
JOB_NAME=Bigtop-trunk-iTest
BUILD_DISPLAY_NAME=#1486
JENKINS_URL=https://builds.apache.org/
BUILD_ID=2013-07-30_12-17-00
HOME=/home/jenkins
M2_HOME=/home/hudson/tools/maven/apache-maven-3.0.4
SHLVL=2
GIT_BRANCH=master
JENKINS_SERVER_COOKIE=f4ebd1e6b0d976e8
EXECUTOR_NUMBER=0
GIT_URL=https://git-wip-us.apache.org/repos/asf/bigtop.git
NODE_LABELS=Ubuntu hadoop10 ubuntu ubuntu4
LOGNAME=jenkins
HUDSON_HOME=/home/hudson/hudson
SSH_CONNECTION=140.211.11.8 49711 67.195.138.60 22
NODE_NAME=ubuntu4
BUILD_NUMBER=1486
HUDSON_COOKIE=7bcd46a6-9a5e-40e4-a855-7fb4322e0d6e
_=/usr/bin/env
Parsing POMs
[bigtop-test-framework] $ /home/hudson/tools/java/latest1.6/bin/java -cp /home/jenkins/jenkins-slave/maven3-agent.jar:/home/hudson/tools/maven/apache-maven-3.0.4/boot/plexus-classworlds-2.4.jar
org.jvnet.hudson.maven3.agent.Maven3Main /home/hudson/tools/maven/apache-maven-3.0.4 /home/jenkins/jenkins-slave/slave.jar
/home/jenkins/jenkins-slave/maven3-interceptor.jar /home/jenkins/jenkins-slave/maven3-interceptor-commons.jar
38675
<===[JENKINS REMOTING CAPACITY]===>channel started
   log4j:WARN No appenders could be found for logger (org.apache.commons.beanutils.converters.BooleanConverter).
log4j:WARN Please initialize the log4j system properly.
Executing Maven:  -B -f <https://builds.apache.org/job/Bigtop-trunk-iTest/ws/bigtop-test-framework/pom.xml>
-Dmaven.repo.local=/home/jenkins/jenkins-slave/maven-repositories/0 deploy
Jul 30, 2013 12:17:24 PM org.apache.maven.cli.event.ExecutionEventLogger projectDiscoveryStarted
INFO: Scanning for projects...
Downloading: http://nexus.codehaus.org/snapshots/org/codehaus/groovy/groovy-eclipse-batch/maven-metadata.xml
Downloading: http://repository.codehaus.org/org/codehaus/groovy/groovy-eclipse-batch/maven-metadata.xml
Downloaded: http://repository.codehaus.org/org/codehaus/groovy/groovy-eclipse-batch/maven-metadata.xml
(2 KB at 2.8 KB/sec)
Jul 30, 2013 12:17:32 PM org.apache.maven.cli.event.ExecutionEventLogger projectStarted
INFO:                                                                         
Jul 30, 2013 12:17:32 PM org.apache.maven.cli.event.ExecutionEventLogger projectStarted
INFO: ------------------------------------------------------------------------
Jul 30, 2013 12:17:32 PM org.apache.maven.cli.event.ExecutionEventLogger projectStarted
INFO: Building iTest: system and integration testing in the cloud 0.7.0-SNAPSHOT
Jul 30, 2013 12:17:32 PM org.apache.maven.cli.event.ExecutionEventLogger projectStarted
INFO: ------------------------------------------------------------------------
Jul 30, 2013 12:17:33 PM org.apache.maven.cli.event.ExecutionEventLogger mojoStarted
INFO: 
Jul 30, 2013 12:17:33 PM org.apache.maven.cli.event.ExecutionEventLogger mojoStarted
INFO: --- groovy-eclipse-compiler:2.7.0-01:add-groovy-build-paths (default-add-groovy-build-paths)
@ itest-common ---
[INFO] Adding /src/main/groovy to the list of source folders
[INFO] Adding /src/test/groovy to the list of test source folders
Jul 30, 2013 12:17:43 PM org.apache.maven.cli.event.ExecutionEventLogger mojoStarted
INFO: 
Jul 30, 2013 12:17:43 PM org.apache.maven.cli.event.ExecutionEventLogger mojoStarted
INFO: --- maven-remote-resources-plugin:1.1:process (default) @ itest-common ---
[INFO] Setting property: classpath.resource.loader.class => 'org.codehaus.plexus.velocity.ContextClassLoaderResourceLoader'.
[INFO] Setting property: velocimacro.messages.on => 'false'.
[INFO] Setting property: resource.loader => 'classpath'.
[INFO] Setting property: resource.manager.logwhenfound => 'false'.
Jul 30, 2013 12:17:45 PM org.apache.maven.cli.event.ExecutionEventLogger mojoStarted
INFO: 
Jul 30, 2013 12:17:45 PM org.apache.maven.cli.event.ExecutionEventLogger mojoStarted
INFO: --- maven-resources-plugin:2.4:resources (default-resources) @ itest-common ---
[INFO] Using 'UTF-8' encoding to copy filtered resources.
[INFO] skip non existing resourceDirectory <https://builds.apache.org/job/Bigtop-trunk-iTest/ws/bigtop-test-framework/src/main/resources>
[INFO] Copying 3 resources
Jul 30, 2013 12:17:45 PM org.apache.maven.cli.event.ExecutionEventLogger mojoStarted
INFO: 
Jul 30, 2013 12:17:45 PM org.apache.maven.cli.event.ExecutionEventLogger mojoStarted
INFO: --- maven-compiler-plugin:2.3.2:compile (default-compile) @ itest-common ---
Downloading: http://repository.apache.org/snapshots/org/codehaus/groovy/groovy-eclipse-batch/maven-metadata.xml
[INFO] Nothing to compile - all classes are up to date
Jul 30, 2013 12:17:47 PM org.apache.maven.cli.event.ExecutionEventLogger mojoStarted
INFO: 
Jul 30, 2013 12:17:47 PM org.apache.maven.cli.event.ExecutionEventLogger mojoStarted
INFO: --- maven-resources-plugin:2.4:testResources (default-testResources) @ itest-common
---
[INFO] Using 'UTF-8' encoding to copy filtered resources.
[INFO] skip non existing resourceDirectory <https://builds.apache.org/job/Bigtop-trunk-iTest/ws/bigtop-test-framework/src/test/resources>
[INFO] Copying 3 resources
Jul 30, 2013 12:17:47 PM org.apache.maven.cli.event.ExecutionEventLogger mojoStarted
INFO: 
Jul 30, 2013 12:17:47 PM org.apache.maven.cli.event.ExecutionEventLogger mojoStarted
INFO: --- maven-compiler-plugin:2.3.2:testCompile (default-testCompile) @ itest-common ---
[INFO] Nothing to compile - all classes are up to date
Jul 30, 2013 12:17:47 PM org.apache.maven.cli.event.ExecutionEventLogger mojoStarted
INFO: 
Jul 30, 2013 12:17:47 PM org.apache.maven.cli.event.ExecutionEventLogger mojoStarted
INFO: --- maven-surefire-plugin:2.4.3:test (default-test) @ itest-common ---
[INFO] Surefire report directory: <https://builds.apache.org/job/Bigtop-trunk-iTest/ws/bigtop-test-framework/target/surefire-reports>

-------------------------------------------------------
 T E S T S
-------------------------------------------------------
Running org.apache.bigtop.itest.JUnitUtilsTest
Disclaimer: This test expected to show a failure in an embeded testcase
    [junit] Running org.apache.bigtop.itest.DummyTestPassTests run: 1, Failures: 0, Errors:
0, Time elapsed: 0.266 secRunning org.apache.bigtop.itest.DummyTestFail
    [junit] Tests run: 1, Failures: 1, Errors: 0, Time elapsed: 0.154 secTEST org.apache.bigtop.itest.DummyTestFail
FAILED
    [junit] Tests FAILED
Disclaimer: This test expected to show an error in an embeded testcase
    [junit] Running org.apache.bigtop.itest.DummyTestError
    [junit] Tests run: 1, Failures: 0, Errors: 1, Time elapsed: 0.278 sec
    [junit] Test org.apache.bigtop.itest.DummyTestError FAILED
    [junit] Running org.apache.bigtop.itest.DummyTestPass
    [junit] Tests run: 1, Failures: 0, Errors: 0, Time elapsed: 0.265 sec
    [junit] Running org.apache.bigtop.itest.DummyTestPass
    [junit] Tests run: 1, Failures: 0, Errors: 0, Time elapsed: 0.266 sec
Tests run: 4, Failures: 0, Errors: 0, Skipped: 0, Time elapsed: 4.665 sec
Running org.apache.bigtop.itest.pmanager.PackageManagerTest
/etc/cron.weekly/.placeholder
/etc/init/cron.conf
/etc/cron.hourly/.placeholder
/etc/cron.monthly/.placeholder
/etc/default/cron
/etc/pam.d/cron
/etc/cron.daily/.placeholder
/etc/cron.daily/standard
/etc/cron.d/.placeholder
/etc/crontab
/.
/var
/var/spool
/var/spool/cron
/var/spool/cron/crontabs
/usr
/usr/sbin
/usr/sbin/cron
/usr/bin
/usr/bin/crontab
/usr/share
/usr/share/bug
/usr/share/bug/cron
/usr/share/bug/cron/control
/usr/share/bug/cron/script
/usr/share/doc
/usr/share/doc/cron
/usr/share/doc/cron/README
/usr/share/doc/cron/THANKS
/usr/share/doc/cron/TODO.Debian
/usr/share/doc/cron/changelog.Debian.gz
/usr/share/doc/cron/README.Debian
/usr/share/doc/cron/copyright
/usr/share/doc/cron/README.anacron
/usr/share/doc/cron/examples
/usr/share/doc/cron/examples/cron-stats.pl
/usr/share/doc/cron/examples/crontab2english.pl
/usr/share/doc/cron/examples/cron-tasks-review.sh
/usr/share/doc/cron/NEWS.Debian.gz
/usr/share/doc/cron/FEATURES
/usr/share/man
/usr/share/man/man1
/usr/share/man/man1/crontab.1.gz
/usr/share/man/man5
/usr/share/man/man5/crontab.5.gz
/usr/share/man/man8
/usr/share/man/man8/cron.8.gz
/etc
/etc/cron.weekly
/etc/cron.weekly/.placeholder
/etc/init.d
/etc/init
/etc/init/cron.conf
/etc/cron.hourly
/etc/cron.hourly/.placeholder
/etc/cron.monthly
/etc/cron.monthly/.placeholder
/etc/default
/etc/default/cron
/etc/pam.d
/etc/pam.d/cron
/etc/cron.daily
/etc/cron.daily/.placeholder
/etc/cron.daily/standard
/etc/cron.d
/etc/cron.d/.placeholder
/etc/crontab
/etc/init.d/cron
Tests run: 11, Failures: 0, Errors: 1, Skipped: 3, Time elapsed: 4.074 sec <<< FAILURE!
Running org.apache.bigtop.itest.JarContentTest
log4j:WARN No appenders could be found for logger (org.apache.bigtop.itest.JarContent).
log4j:WARN Please initialize the log4j system properly.
Tests run: 6, Failures: 0, Errors: 0, Skipped: 0, Time elapsed: 0.934 sec
Running org.apache.bigtop.itest.posix.UGITest
Tests run: 2, Failures: 0, Errors: 0, Skipped: 0, Time elapsed: 0.058 sec
Running org.apache.bigtop.itest.posix.ServiceTest
Status []
Tests run: 2, Failures: 0, Errors: 0, Skipped: 1, Time elapsed: 0.184 sec
Running org.apache.bigtop.itest.shell.ShellTest
Tests run: 2, Failures: 0, Errors: 0, Skipped: 1, Time elapsed: 0.015 sec
Running org.apache.bigtop.itest.posix.AlternativeTest
Tests run: 1, Failures: 0, Errors: 0, Skipped: 0, Time elapsed: 1.706 sec
Running org.apache.bigtop.itest.junit.OrderedParameterizedTest
Tests run: 3, Failures: 0, Errors: 0, Skipped: 0, Time elapsed: 0.012 sec
Running org.apache.bigtop.itest.TestListUtilsTest
Tests run: 1, Failures: 0, Errors: 0, Skipped: 0, Time elapsed: 0.024 sec
Running org.apache.bigtop.itest.TestContractGroovy
Tests run: 2, Failures: 0, Errors: 0, Skipped: 0, Time elapsed: 0.02 sec
Running org.apache.bigtop.itest.TestContractJava
Tests run: 2, Failures: 0, Errors: 0, Skipped: 0, Time elapsed: 0.014 sec
Running org.apache.bigtop.itest.TestContractJavaProc
Tests run: 2, Failures: 0, Errors: 0, Skipped: 0, Time elapsed: 0.002 sec

Results :

Tests in error: 
  testLookupGcc(org.apache.bigtop.itest.pmanager.PackageManagerTest)

Tests run: 38, Failures: 0, Errors: 1, Skipped: 5

[ERROR] There are test failures.

Please refer to <https://builds.apache.org/job/Bigtop-trunk-iTest/ws/bigtop-test-framework/target/surefire-reports>
for the individual test results.
ERROR: Maven JVM terminated unexpectedly with exit code 143


Mime
View raw message