bigtop-ci mailing list archives

Site index · List index
Message view « Date » · « Thread »
Top « Date » · « Thread »
From Apache Jenkins Server <jenk...@builds.apache.org>
Subject Build failed in Jenkins: Bigtop-trunk-iTest #1459
Date Sat, 27 Jul 2013 22:46:32 GMT
See <https://builds.apache.org/job/Bigtop-trunk-iTest/1459/changes>

Changes:

[cos] BIGTOP-938. Bigtop currently uses Junit 4.8.2, would be useful to upgrade to the latest
one that is Junit 4.11.

------------------------------------------
Started by an SCM change
Building remotely on ubuntu3 in workspace <https://builds.apache.org/job/Bigtop-trunk-iTest/ws/>
Checkout:Bigtop-trunk-iTest / <https://builds.apache.org/job/Bigtop-trunk-iTest/ws/>
- hudson.remoting.Channel@5768fe94:ubuntu3
Using strategy: Default
Last Built Revision: Revision b2c03ce0353abff02af0a84553ae30f4e04aca88 (origin/master)
Fetching changes from 1 remote Git repository
Fetching upstream changes from origin
Commencing build of Revision 7d9b7317af24af50143c9b636cbd3ac78bb1c202 (origin/master)
Checking out Revision 7d9b7317af24af50143c9b636cbd3ac78bb1c202 (origin/master)
[Bigtop-trunk-iTest] $ /bin/bash -xe /tmp/hudson3362513983236729691.sh
+ export JAVA_HOME=/home/hudson/tools/java/latest
+ JAVA_HOME=/home/hudson/tools/java/latest
+ export PATH=/home/hudson/tools/java/latest/bin:/home/hudson/tools/maven/apache-maven-3.0.4/bin:/home/hudson/tools/java/latest1.6/bin:/home/hudson/tools/java/latest1.6/bin:/usr/local/sbin:/usr/local/bin:/usr/sbin:/usr/bin:/sbin:/bin:/usr/bin/X11:/usr/games
+ PATH=/home/hudson/tools/java/latest/bin:/home/hudson/tools/maven/apache-maven-3.0.4/bin:/home/hudson/tools/java/latest1.6/bin:/home/hudson/tools/java/latest1.6/bin:/usr/local/sbin:/usr/local/bin:/usr/sbin:/usr/bin:/sbin:/bin:/usr/bin/X11:/usr/games
+ env
BUILD_URL=https://builds.apache.org/job/Bigtop-trunk-iTest/1459/
HUDSON_SERVER_COOKIE=f4ebd1e6b0d976e8
SHELL=/bin/bash
SSH_CLIENT=140.211.11.8 55988 22
BUILD_TAG=jenkins-Bigtop-trunk-iTest-1459
GIT_PREVIOUS_COMMIT=b2c03ce0353abff02af0a84553ae30f4e04aca88
WORKSPACE=<https://builds.apache.org/job/Bigtop-trunk-iTest/ws/>
JOB_URL=https://builds.apache.org/job/Bigtop-trunk-iTest/
USER=jenkins
LD_LIBRARY_PATH=/usr/lib/jvm/java-6-openjdk-amd64/jre/lib/amd64/server:/usr/lib/jvm/java-6-openjdk-amd64/jre/lib/amd64:/usr/lib/jvm/java-6-openjdk-amd64/jre/../lib/amd64
GIT_COMMIT=7d9b7317af24af50143c9b636cbd3ac78bb1c202
JENKINS_HOME=/home/hudson/hudson
PATH=/home/hudson/tools/java/latest/bin:/home/hudson/tools/maven/apache-maven-3.0.4/bin:/home/hudson/tools/java/latest1.6/bin:/home/hudson/tools/java/latest1.6/bin:/usr/local/sbin:/usr/local/bin:/usr/sbin:/usr/bin:/sbin:/bin:/usr/bin/X11:/usr/games
MAIL=/var/mail/jenkins
MAVEN_HOME=/home/hudson/tools/maven/apache-maven-3.0.4
PWD=/x1/jenkins/jenkins-slave/workspace/Bigtop-trunk-iTest
JAVA_HOME=/home/hudson/tools/java/latest
HUDSON_URL=https://builds.apache.org/
JOB_NAME=Bigtop-trunk-iTest
BUILD_DISPLAY_NAME=#1459
JENKINS_URL=https://builds.apache.org/
BUILD_ID=2013-07-27_22-45-53
HOME=/home/jenkins
M2_HOME=/home/hudson/tools/maven/apache-maven-3.0.4
SHLVL=2
GIT_BRANCH=master
JENKINS_SERVER_COOKIE=f4ebd1e6b0d976e8
EXECUTOR_NUMBER=1
GIT_URL=https://git-wip-us.apache.org/repos/asf/bigtop.git
NODE_LABELS=Ubuntu ubuntu ubuntu3
LOGNAME=jenkins
HUDSON_HOME=/home/hudson/hudson
SSH_CONNECTION=140.211.11.8 55988 140.211.11.27 22
NODE_NAME=ubuntu3
BUILD_NUMBER=1459
HUDSON_COOKIE=17092ae1-e85d-4143-bf3e-51d9135c67f7
_=/usr/bin/env
Parsing POMs
Modules changed, recalculating dependency graph
[bigtop-test-framework] $ /home/hudson/tools/java/latest1.6/bin/java -cp /home/jenkins/jenkins-slave/maven3-agent.jar:/home/hudson/tools/maven/apache-maven-3.0.4/boot/plexus-classworlds-2.4.jar
org.jvnet.hudson.maven3.agent.Maven3Main /home/hudson/tools/maven/apache-maven-3.0.4 /x1/jenkins/jenkins-slave/slave.jar
/home/jenkins/jenkins-slave/maven3-interceptor.jar /home/jenkins/jenkins-slave/maven3-interceptor-commons.jar
59332
<===[JENKINS REMOTING CAPACITY]===>   channel started
log4j:WARN No appenders could be found for logger (org.apache.commons.beanutils.converters.BooleanConverter).
log4j:WARN Please initialize the log4j system properly.
Executing Maven:  -B -f <https://builds.apache.org/job/Bigtop-trunk-iTest/ws/bigtop-test-framework/pom.xml>
-Dmaven.repo.local=/home/jenkins/jenkins-slave/maven-repositories/1 deploy
Jul 27, 2013 10:46:26 PM org.apache.maven.cli.event.ExecutionEventLogger projectDiscoveryStarted
INFO: Scanning for projects...
Downloading: http://repository.codehaus.org/org/codehaus/groovy/groovy-eclipse-batch/maven-metadata.xml
Downloading: http://nexus.codehaus.org/snapshots/org/codehaus/groovy/groovy-eclipse-batch/maven-metadata.xml
Downloaded: http://repository.codehaus.org/org/codehaus/groovy/groovy-eclipse-batch/maven-metadata.xml
(2 KB at 1.8 KB/sec)
Jul 27, 2013 10:46:28 PM org.apache.maven.cli.event.ExecutionEventLogger projectStarted
INFO:                                                                         
Jul 27, 2013 10:46:28 PM org.apache.maven.cli.event.ExecutionEventLogger projectStarted
INFO: ------------------------------------------------------------------------
Jul 27, 2013 10:46:28 PM org.apache.maven.cli.event.ExecutionEventLogger projectStarted
INFO: Building iTest: system and integration testing in the cloud 0.7.0-SNAPSHOT
Jul 27, 2013 10:46:28 PM org.apache.maven.cli.event.ExecutionEventLogger projectStarted
INFO: ------------------------------------------------------------------------
Downloading: http://repo.maven.apache.org/maven2/junit/junit/4.11za/junit-4.11za.pom
[WARNING] The POM for junit:junit:jar:4.11za is missing, no dependency information available
Downloading: http://repo.maven.apache.org/maven2/junit/junit/4.11za/junit-4.11za.jar
Jul 27, 2013 10:46:29 PM org.apache.maven.cli.event.ExecutionEventLogger logResult
INFO: ------------------------------------------------------------------------
Jul 27, 2013 10:46:29 PM org.apache.maven.cli.event.ExecutionEventLogger logResult
INFO: BUILD FAILURE
Jul 27, 2013 10:46:29 PM org.apache.maven.cli.event.ExecutionEventLogger logStats
INFO: ------------------------------------------------------------------------
Jul 27, 2013 10:46:29 PM org.apache.maven.cli.event.ExecutionEventLogger logStats
INFO: Total time: 3.442s
Jul 27, 2013 10:46:29 PM org.apache.maven.cli.event.ExecutionEventLogger logStats
INFO: Finished at: Sat Jul 27 22:46:29 UTC 2013
Jul 27, 2013 10:46:29 PM org.apache.maven.cli.event.ExecutionEventLogger logStats
INFO: Final Memory: 5M/61M
Jul 27, 2013 10:46:29 PM org.apache.maven.cli.event.ExecutionEventLogger sessionEnded
INFO: ------------------------------------------------------------------------
[JENKINS] Archiving <https://builds.apache.org/job/Bigtop-trunk-iTest/ws/bigtop-test-framework/pom.xml>
to /home/hudson/hudson/jobs/Bigtop-trunk-iTest/modules/org.apache.bigtop.itest$itest-common/builds/2013-07-27_22-46-22/archive/org.apache.bigtop.itest/itest-common/0.7.0-SNAPSHOT/itest-common-0.7.0-SNAPSHOT.pom
Waiting for Jenkins to finish collecting data
mavenExecutionResult exceptions not empty
message : Failed to execute goal on project itest-common: Could not resolve dependencies for
project org.apache.bigtop.itest:itest-common:jar:0.7.0-SNAPSHOT: Could not find artifact junit:junit:jar:4.11za
in central (http://repo.maven.apache.org/maven2)
cause : Could not resolve dependencies for project org.apache.bigtop.itest:itest-common:jar:0.7.0-SNAPSHOT:
Could not find artifact junit:junit:jar:4.11za in central (http://repo.maven.apache.org/maven2)
Stack trace : 
org.apache.maven.lifecycle.LifecycleExecutionException: Failed to execute goal on project
itest-common: Could not resolve dependencies for project org.apache.bigtop.itest:itest-common:jar:0.7.0-SNAPSHOT:
Could not find artifact junit:junit:jar:4.11za in central (http://repo.maven.apache.org/maven2)
	at org.apache.maven.lifecycle.internal.LifecycleDependencyResolver.getDependencies(LifecycleDependencyResolver.java:210)
	at org.apache.maven.lifecycle.internal.LifecycleDependencyResolver.resolveProjectDependencies(LifecycleDependencyResolver.java:117)
	at org.apache.maven.lifecycle.internal.MojoExecutor.ensureDependenciesAreResolved(MojoExecutor.java:258)
	at org.apache.maven.lifecycle.internal.MojoExecutor.execute(MojoExecutor.java:201)
	at org.apache.maven.lifecycle.internal.MojoExecutor.execute(MojoExecutor.java:153)
	at org.apache.maven.lifecycle.internal.MojoExecutor.execute(MojoExecutor.java:145)
	at org.apache.maven.lifecycle.internal.LifecycleModuleBuilder.buildProject(LifecycleModuleBuilder.java:84)
	at org.apache.maven.lifecycle.internal.LifecycleModuleBuilder.buildProject(LifecycleModuleBuilder.java:59)
	at org.apache.maven.lifecycle.internal.LifecycleStarter.singleThreadedBuild(LifecycleStarter.java:183)
	at org.apache.maven.lifecycle.internal.LifecycleStarter.execute(LifecycleStarter.java:161)
	at org.apache.maven.DefaultMaven.doExecute(DefaultMaven.java:320)
	at org.apache.maven.DefaultMaven.execute(DefaultMaven.java:156)
	at org.jvnet.hudson.maven3.launcher.Maven3Launcher.main(Maven3Launcher.java:117)
	at sun.reflect.NativeMethodAccessorImpl.invoke0(Native Method)
	at sun.reflect.NativeMethodAccessorImpl.invoke(NativeMethodAccessorImpl.java:39)
	at sun.reflect.DelegatingMethodAccessorImpl.invoke(DelegatingMethodAccessorImpl.java:25)
	at java.lang.reflect.Method.invoke(Method.java:597)
	at org.codehaus.plexus.classworlds.launcher.Launcher.launchStandard(Launcher.java:329)
	at org.codehaus.plexus.classworlds.launcher.Launcher.launch(Launcher.java:239)
	at org.jvnet.hudson.maven3.agent.Maven3Main.launch(Maven3Main.java:178)
	at sun.reflect.NativeMethodAccessorImpl.invoke0(Native Method)
	at sun.reflect.NativeMethodAccessorImpl.invoke(NativeMethodAccessorImpl.java:39)
	at sun.reflect.DelegatingMethodAccessorImpl.invoke(DelegatingMethodAccessorImpl.java:25)
	at java.lang.reflect.Method.invoke(Method.java:597)
	at hudson.maven.Maven3Builder.call(Maven3Builder.java:129)
	at hudson.maven.Maven3Builder.call(Maven3Builder.java:67)
	at hudson.remoting.UserRequest.perform(UserRequest.java:118)
	at hudson.remoting.UserRequest.perform(UserRequest.java:48)
	at hudson.remoting.Request$2.run(Request.java:326)
	at hudson.remoting.InterceptingExecutorService$1.call(InterceptingExecutorService.java:72)
	at java.util.concurrent.FutureTask$Sync.innerRun(FutureTask.java:303)
	at java.util.concurrent.FutureTask.run(FutureTask.java:138)
	at java.util.concurrent.ThreadPoolExecutor$Worker.runTask(ThreadPoolExecutor.java:895)
	at java.util.concurrent.ThreadPoolExecutor$Worker.run(ThreadPoolExecutor.java:918)
	at java.lang.Thread.run(Thread.java:662)
Caused by: org.apache.maven.project.DependencyResolutionException: Could not resolve dependencies
for project org.apache.bigtop.itest:itest-common:jar:0.7.0-SNAPSHOT: Could not find artifact
junit:junit:jar:4.11za in central (http://repo.maven.apache.org/maven2)
	at org.apache.maven.project.DefaultProjectDependenciesResolver.resolve(DefaultProjectDependenciesResolver.java:189)
	at org.apache.maven.lifecycle.internal.LifecycleDependencyResolver.getDependencies(LifecycleDependencyResolver.java:185)
	... 34 more
Caused by: org.sonatype.aether.resolution.DependencyResolutionException: Could not find artifact
junit:junit:jar:4.11za in central (http://repo.maven.apache.org/maven2)
	at org.sonatype.aether.impl.internal.DefaultRepositorySystem.resolveDependencies(DefaultRepositorySystem.java:375)
	at org.apache.maven.project.DefaultProjectDependenciesResolver.resolve(DefaultProjectDependenciesResolver.java:183)
	... 35 more
Caused by: org.sonatype.aether.resolution.ArtifactResolutionException: Could not find artifact
junit:junit:jar:4.11za in central (http://repo.maven.apache.org/maven2)
	at org.sonatype.aether.impl.internal.DefaultArtifactResolver.resolve(DefaultArtifactResolver.java:538)
	at org.sonatype.aether.impl.internal.DefaultArtifactResolver.resolveArtifacts(DefaultArtifactResolver.java:216)
	at org.sonatype.aether.impl.internal.DefaultRepositorySystem.resolveDependencies(DefaultRepositorySystem.java:358)
	... 36 more
Caused by: org.sonatype.aether.transfer.ArtifactNotFoundException: Could not find artifact
junit:junit:jar:4.11za in central (http://repo.maven.apache.org/maven2)
	at org.sonatype.aether.connector.wagon.WagonRepositoryConnector$4.wrap(WagonRepositoryConnector.java:947)
	at org.sonatype.aether.connector.wagon.WagonRepositoryConnector$4.wrap(WagonRepositoryConnector.java:941)
	at org.sonatype.aether.connector.wagon.WagonRepositoryConnector$GetTask.run(WagonRepositoryConnector.java:669)
	at org.sonatype.aether.util.concurrency.RunnableErrorForwarder$1.run(RunnableErrorForwarder.java:60)
	... 3 more
Sending e-mails to: ci@bigtop.apache.org
channel stopped

Mime
View raw message