bigtop-ci mailing list archives

Site index · List index
Message view « Date » · « Thread »
Top « Date » · « Thread »
From Apache Jenkins Server <jenk...@builds.apache.org>
Subject Build failed in Jenkins: Bigtop-trunk-testartifacts #1307
Date Sat, 27 Jul 2013 22:49:39 GMT
See <https://builds.apache.org/job/Bigtop-trunk-testartifacts/1307/changes>

Changes:

[cos] BIGTOP-938. Bigtop currently uses Junit 4.8.2, would be useful to upgrade to the latest
one that is Junit 4.11.

------------------------------------------
Started by an SCM change
Building remotely on ubuntu4 in workspace <https://builds.apache.org/job/Bigtop-trunk-testartifacts/ws/>
Checkout:Bigtop-trunk-testartifacts / <https://builds.apache.org/job/Bigtop-trunk-testartifacts/ws/>
- hudson.remoting.Channel@61e41dda:ubuntu4
Using strategy: Default
Last Built Revision: Revision b2c03ce0353abff02af0a84553ae30f4e04aca88 (origin/master)
Fetching changes from 1 remote Git repository
Fetching upstream changes from origin
Commencing build of Revision 7d9b7317af24af50143c9b636cbd3ac78bb1c202 (origin/master)
Checking out Revision 7d9b7317af24af50143c9b636cbd3ac78bb1c202 (origin/master)
Parsing POMs
Modules changed, recalculating dependency graph
[test-artifacts] $ /home/hudson/tools/java/latest1.6/bin/java -cp /home/jenkins/jenkins-slave/maven3-agent.jar:/home/hudson/tools/maven/apache-maven-3.0.4/boot/plexus-classworlds-2.4.jar
org.jvnet.hudson.maven3.agent.Maven3Main /home/hudson/tools/maven/apache-maven-3.0.4 /home/jenkins/jenkins-slave/slave.jar
/home/jenkins/jenkins-slave/maven3-interceptor.jar /home/jenkins/jenkins-slave/maven3-interceptor-commons.jar
56146
<===[JENKINS REMOTING CAPACITY]===>channel started
   log4j:WARN No appenders could be found for logger (org.apache.commons.beanutils.converters.BooleanConverter).
log4j:WARN Please initialize the log4j system properly.
Executing Maven:  -B -f <https://builds.apache.org/job/Bigtop-trunk-testartifacts/ws/bigtop-tests/test-artifacts/pom.xml>
-Dmaven.repo.local=/home/jenkins/jenkins-slave/maven-repositories/1 -U clean deploy
Jul 27, 2013 10:46:35 PM org.apache.maven.cli.event.ExecutionEventLogger projectDiscoveryStarted
INFO: Scanning for projects...
Downloading: http://repo.maven.apache.org/maven2/org/codehaus/groovy/groovy-eclipse-batch/maven-metadata.xml
Downloading: http://repository.codehaus.org/org/codehaus/groovy/groovy-eclipse-batch/maven-metadata.xml
Downloading: http://nexus.codehaus.org/snapshots/org/codehaus/groovy/groovy-eclipse-batch/maven-metadata.xml
Downloaded: http://repo.maven.apache.org/maven2/org/codehaus/groovy/groovy-eclipse-batch/maven-metadata.xml
(2 KB at 3.8 KB/sec)
Downloaded: http://repository.codehaus.org/org/codehaus/groovy/groovy-eclipse-batch/maven-metadata.xml
(2 KB at 2.0 KB/sec)
Jul 27, 2013 10:46:37 PM org.apache.maven.cli.event.ExecutionEventLogger sessionStarted
INFO: ------------------------------------------------------------------------
Jul 27, 2013 10:46:37 PM org.apache.maven.cli.event.ExecutionEventLogger sessionStarted
INFO: Reactor Build Order:
Jul 27, 2013 10:46:37 PM org.apache.maven.cli.event.ExecutionEventLogger sessionStarted
INFO: 
Jul 27, 2013 10:46:37 PM org.apache.maven.cli.event.ExecutionEventLogger sessionStarted
INFO: bigtop-smokes
Jul 27, 2013 10:46:37 PM org.apache.maven.cli.event.ExecutionEventLogger sessionStarted
INFO: hadoopsmoke
Jul 27, 2013 10:46:37 PM org.apache.maven.cli.event.ExecutionEventLogger sessionStarted
INFO: packagesmoke
Jul 27, 2013 10:46:37 PM org.apache.maven.cli.event.ExecutionEventLogger sessionStarted
INFO: ooziesmoke
Jul 27, 2013 10:46:37 PM org.apache.maven.cli.event.ExecutionEventLogger sessionStarted
INFO: hivesmoke
Jul 27, 2013 10:46:37 PM org.apache.maven.cli.event.ExecutionEventLogger sessionStarted
INFO: hbasesmoke
Jul 27, 2013 10:46:37 PM org.apache.maven.cli.event.ExecutionEventLogger sessionStarted
INFO: flumesmoke
Jul 27, 2013 10:46:37 PM org.apache.maven.cli.event.ExecutionEventLogger sessionStarted
INFO: sqoopsmokes
Jul 27, 2013 10:46:37 PM org.apache.maven.cli.event.ExecutionEventLogger sessionStarted
INFO: mahoutsmoke
Jul 27, 2013 10:46:37 PM org.apache.maven.cli.event.ExecutionEventLogger sessionStarted
INFO: giraphsmoke
Jul 27, 2013 10:46:37 PM org.apache.maven.cli.event.ExecutionEventLogger sessionStarted
INFO: huesmoke
Jul 27, 2013 10:46:37 PM org.apache.maven.cli.event.ExecutionEventLogger sessionStarted
INFO: solrsmoke
Jul 27, 2013 10:46:37 PM org.apache.maven.cli.event.ExecutionEventLogger sessionStarted
INFO: crunchsmoke
Jul 27, 2013 10:46:37 PM org.apache.maven.cli.event.ExecutionEventLogger sessionStarted
INFO: datafusmoke
Jul 27, 2013 10:46:37 PM org.apache.maven.cli.event.ExecutionEventLogger sessionStarted
INFO: fatjar
Jul 27, 2013 10:46:37 PM org.apache.maven.cli.event.ExecutionEventLogger sessionStarted
INFO: hcatalogsmoke
Jul 27, 2013 10:46:39 PM org.apache.maven.cli.event.ExecutionEventLogger projectStarted
INFO:                                                                         
Jul 27, 2013 10:46:39 PM org.apache.maven.cli.event.ExecutionEventLogger projectStarted
INFO: ------------------------------------------------------------------------
Jul 27, 2013 10:46:39 PM org.apache.maven.cli.event.ExecutionEventLogger projectStarted
INFO: Building bigtop-smokes 0.7.0-SNAPSHOT
Jul 27, 2013 10:46:39 PM org.apache.maven.cli.event.ExecutionEventLogger projectStarted
INFO: ------------------------------------------------------------------------
Downloading: http://repository.apache.org/snapshots/org/apache/bigtop/itest/itest-common/0.7.0-SNAPSHOT/maven-metadata.xml
Downloaded: http://repository.apache.org/snapshots/org/apache/bigtop/itest/itest-common/0.7.0-SNAPSHOT/maven-metadata.xml
(1005 B at 0.2 KB/sec)
Downloading: http://repository.apache.org/snapshots/org/apache/bigtop/itest/itest-common/0.7.0-SNAPSHOT/itest-common-0.7.0-20130727.221247-249.pom
Downloaded: http://repository.apache.org/snapshots/org/apache/bigtop/itest/itest-common/0.7.0-SNAPSHOT/itest-common-0.7.0-20130727.221247-249.pom
(5 KB at 8.3 KB/sec)
Downloading: http://repository.apache.org/snapshots/org/apache/bigtop/bigtop/0.7.0-SNAPSHOT/maven-metadata.xml
Downloaded: http://repository.apache.org/snapshots/org/apache/bigtop/bigtop/0.7.0-SNAPSHOT/maven-metadata.xml
(604 B at 1.1 KB/sec)
Downloading: http://repository.apache.org/snapshots/org/apache/bigtop/bigtop/0.7.0-SNAPSHOT/bigtop-0.7.0-20130727.220300-128.pom
Downloaded: http://repository.apache.org/snapshots/org/apache/bigtop/bigtop/0.7.0-SNAPSHOT/bigtop-0.7.0-20130727.220300-128.pom
(14 KB at 44.7 KB/sec)
Downloading: http://repo.maven.apache.org/maven2/junit/junit/4.11za/junit-4.11za.pom
[WARNING] The POM for junit:junit:jar:4.11za is missing, no dependency information available
Downloading: http://repository.apache.org/snapshots/org/apache/bigtop/itest/itest-common/0.7.0-SNAPSHOT/itest-common-0.7.0-20130727.221247-249.jar
Downloaded: http://repository.apache.org/snapshots/org/apache/bigtop/itest/itest-common/0.7.0-SNAPSHOT/itest-common-0.7.0-20130727.221247-249.jar
(180 KB at 197.5 KB/sec)
Downloading: http://repo.maven.apache.org/maven2/junit/junit/4.11za/junit-4.11za.jar
Jul 27, 2013 10:46:46 PM org.apache.maven.cli.event.ExecutionEventLogger logReactorSummary
INFO: ------------------------------------------------------------------------
Jul 27, 2013 10:46:46 PM org.apache.maven.cli.event.ExecutionEventLogger logReactorSummary
INFO: Reactor Summary:
Jul 27, 2013 10:46:46 PM org.apache.maven.cli.event.ExecutionEventLogger logReactorSummary
INFO: 
Jul 27, 2013 10:46:46 PM org.apache.maven.cli.event.ExecutionEventLogger logReactorSummary
INFO: bigtop-smokes ..................................... FAILURE [7.523s]
Jul 27, 2013 10:46:46 PM org.apache.maven.cli.event.ExecutionEventLogger logReactorSummary
INFO: hadoopsmoke ....................................... SKIPPED
Jul 27, 2013 10:46:46 PM org.apache.maven.cli.event.ExecutionEventLogger logReactorSummary
INFO: packagesmoke ...................................... SKIPPED
Jul 27, 2013 10:46:46 PM org.apache.maven.cli.event.ExecutionEventLogger logReactorSummary
INFO: ooziesmoke ........................................ SKIPPED
Jul 27, 2013 10:46:46 PM org.apache.maven.cli.event.ExecutionEventLogger logReactorSummary
INFO: hivesmoke ......................................... SKIPPED
Jul 27, 2013 10:46:46 PM org.apache.maven.cli.event.ExecutionEventLogger logReactorSummary
INFO: hbasesmoke ........................................ SKIPPED
Jul 27, 2013 10:46:46 PM org.apache.maven.cli.event.ExecutionEventLogger logReactorSummary
INFO: flumesmoke ........................................ SKIPPED
Jul 27, 2013 10:46:46 PM org.apache.maven.cli.event.ExecutionEventLogger logReactorSummary
INFO: sqoopsmokes ....................................... SKIPPED
Jul 27, 2013 10:46:46 PM org.apache.maven.cli.event.ExecutionEventLogger logReactorSummary
INFO: mahoutsmoke ....................................... SKIPPED
Jul 27, 2013 10:46:46 PM org.apache.maven.cli.event.ExecutionEventLogger logReactorSummary
INFO: giraphsmoke ....................................... SKIPPED
Jul 27, 2013 10:46:46 PM org.apache.maven.cli.event.ExecutionEventLogger logReactorSummary
INFO: huesmoke .......................................... SKIPPED
Jul 27, 2013 10:46:46 PM org.apache.maven.cli.event.ExecutionEventLogger logReactorSummary
INFO: solrsmoke ......................................... SKIPPED
Jul 27, 2013 10:46:46 PM org.apache.maven.cli.event.ExecutionEventLogger logReactorSummary
INFO: crunchsmoke ....................................... SKIPPED
Jul 27, 2013 10:46:46 PM org.apache.maven.cli.event.ExecutionEventLogger logReactorSummary
INFO: datafusmoke ....................................... SKIPPED
Jul 27, 2013 10:46:46 PM org.apache.maven.cli.event.ExecutionEventLogger logReactorSummary
INFO: fatjar ............................................ SKIPPED
Jul 27, 2013 10:46:46 PM org.apache.maven.cli.event.ExecutionEventLogger logReactorSummary
INFO: hcatalogsmoke ..................................... SKIPPED
Jul 27, 2013 10:46:46 PM org.apache.maven.cli.event.ExecutionEventLogger logResult
INFO: ------------------------------------------------------------------------
Jul 27, 2013 10:46:46 PM org.apache.maven.cli.event.ExecutionEventLogger logResult
INFO: BUILD FAILURE
Jul 27, 2013 10:46:46 PM org.apache.maven.cli.event.ExecutionEventLogger logStats
INFO: ------------------------------------------------------------------------
Jul 27, 2013 10:46:46 PM org.apache.maven.cli.event.ExecutionEventLogger logStats
INFO: Total time: 10.778s
Jul 27, 2013 10:46:46 PM org.apache.maven.cli.event.ExecutionEventLogger logStats
INFO: Finished at: Sat Jul 27 22:46:46 UTC 2013
Jul 27, 2013 10:46:46 PM org.apache.maven.cli.event.ExecutionEventLogger logStats
INFO: Final Memory: 7M/78M
Jul 27, 2013 10:46:46 PM org.apache.maven.cli.event.ExecutionEventLogger sessionEnded
INFO: ------------------------------------------------------------------------
[JENKINS] Archiving <https://builds.apache.org/job/Bigtop-trunk-testartifacts/ws/bigtop-tests/test-artifacts/hcatalog/pom.xml>
to /home/hudson/hudson/jobs/Bigtop-trunk-testartifacts/modules/org.apache.bigtop.itest$hcatalog-smoke/builds/2013-07-27_22-46-26/archive/org.apache.bigtop.itest/hcatalog-smoke/0.7.0-SNAPSHOT/hcatalog-smoke-0.7.0-SNAPSHOT.pom
[JENKINS] Archiving <https://builds.apache.org/job/Bigtop-trunk-testartifacts/ws/bigtop-tests/test-artifacts/sqoop/pom.xml>
to /home/hudson/hudson/jobs/Bigtop-trunk-testartifacts/modules/org.apache.bigtop.itest$sqoop-smoke/builds/2013-07-27_22-46-26/archive/org.apache.bigtop.itest/sqoop-smoke/0.7.0-SNAPSHOT/sqoop-smoke-0.7.0-SNAPSHOT.pom
[JENKINS] Archiving <https://builds.apache.org/job/Bigtop-trunk-testartifacts/ws/bigtop-tests/test-artifacts/hue/pom.xml>
to /home/hudson/hudson/jobs/Bigtop-trunk-testartifacts/modules/org.apache.bigtop.itest$hue-smoke/builds/2013-07-27_22-46-26/archive/org.apache.bigtop.itest/hue-smoke/0.7.0-SNAPSHOT/hue-smoke-0.7.0-SNAPSHOT.pom
[JENKINS] Archiving <https://builds.apache.org/job/Bigtop-trunk-testartifacts/ws/bigtop-tests/test-artifacts/datafu/pom.xml>
to /home/hudson/hudson/jobs/Bigtop-trunk-testartifacts/modules/org.apache.bigtop.itest$datafu-smoke/builds/2013-07-27_22-46-26/archive/org.apache.bigtop.itest/datafu-smoke/0.7.0-SNAPSHOT/datafu-smoke-0.7.0-SNAPSHOT.pom
[JENKINS] Archiving <https://builds.apache.org/job/Bigtop-trunk-testartifacts/ws/bigtop-tests/test-artifacts/oozie/pom.xml>
to /home/hudson/hudson/jobs/Bigtop-trunk-testartifacts/modules/org.apache.bigtop.itest$oozie-smoke/builds/2013-07-27_22-46-26/archive/org.apache.bigtop.itest/oozie-smoke/0.7.0-SNAPSHOT/oozie-smoke-0.7.0-SNAPSHOT.pom
[JENKINS] Archiving <https://builds.apache.org/job/Bigtop-trunk-testartifacts/ws/bigtop-tests/test-artifacts/fatjar/pom.xml>
to /home/hudson/hudson/jobs/Bigtop-trunk-testartifacts/modules/org.apache.bigtop.itest$fat-smoke/builds/2013-07-27_22-46-26/archive/org.apache.bigtop.itest/fat-smoke/0.7.0-SNAPSHOT/fat-smoke-0.7.0-SNAPSHOT.pom
[JENKINS] Archiving <https://builds.apache.org/job/Bigtop-trunk-testartifacts/ws/bigtop-tests/test-artifacts/crunch/pom.xml>
to /home/hudson/hudson/jobs/Bigtop-trunk-testartifacts/modules/org.apache.bigtop.itest$crunch-smoke/builds/2013-07-27_22-46-26/archive/org.apache.bigtop.itest/crunch-smoke/0.7.0-SNAPSHOT/crunch-smoke-0.7.0-SNAPSHOT.pom
[JENKINS] Archiving <https://builds.apache.org/job/Bigtop-trunk-testartifacts/ws/bigtop-tests/test-artifacts/hbase/pom.xml>
to /home/hudson/hudson/jobs/Bigtop-trunk-testartifacts/modules/org.apache.bigtop.itest$hbase-smoke/builds/2013-07-27_22-46-26/archive/org.apache.bigtop.itest/hbase-smoke/0.7.0-SNAPSHOT/hbase-smoke-0.7.0-SNAPSHOT.pom
[JENKINS] Archiving <https://builds.apache.org/job/Bigtop-trunk-testartifacts/ws/bigtop-tests/test-artifacts/giraph/pom.xml>
to /home/hudson/hudson/jobs/Bigtop-trunk-testartifacts/modules/org.apache.bigtop.itest$giraph-smoke/builds/2013-07-27_22-46-26/archive/org.apache.bigtop.itest/giraph-smoke/0.7.0-SNAPSHOT/giraph-smoke-0.7.0-SNAPSHOT.pom
[JENKINS] Archiving <https://builds.apache.org/job/Bigtop-trunk-testartifacts/ws/bigtop-tests/test-artifacts/hive/pom.xml>
to /home/hudson/hudson/jobs/Bigtop-trunk-testartifacts/modules/org.apache.bigtop.itest$hive-smoke/builds/2013-07-27_22-46-26/archive/org.apache.bigtop.itest/hive-smoke/0.7.0-SNAPSHOT/hive-smoke-0.7.0-SNAPSHOT.pom
[JENKINS] Archiving <https://builds.apache.org/job/Bigtop-trunk-testartifacts/ws/bigtop-tests/test-artifacts/mahout/pom.xml>
to /home/hudson/hudson/jobs/Bigtop-trunk-testartifacts/modules/org.apache.bigtop.itest$mahout-smoke/builds/2013-07-27_22-46-26/archive/org.apache.bigtop.itest/mahout-smoke/0.7.0-SNAPSHOT/mahout-smoke-0.7.0-SNAPSHOT.pom
[JENKINS] Archiving <https://builds.apache.org/job/Bigtop-trunk-testartifacts/ws/bigtop-tests/test-artifacts/flume/pom.xml>
to /home/hudson/hudson/jobs/Bigtop-trunk-testartifacts/modules/org.apache.bigtop.itest$flume-smoke/builds/2013-07-27_22-46-26/archive/org.apache.bigtop.itest/flume-smoke/0.7.0-SNAPSHOT/flume-smoke-0.7.0-SNAPSHOT.pom
[JENKINS] Archiving <https://builds.apache.org/job/Bigtop-trunk-testartifacts/ws/bigtop-tests/test-artifacts/package/pom.xml>
to /home/hudson/hudson/jobs/Bigtop-trunk-testartifacts/modules/org.apache.bigtop.itest$package-smoke/builds/2013-07-27_22-46-26/archive/org.apache.bigtop.itest/package-smoke/0.7.0-SNAPSHOT/package-smoke-0.7.0-SNAPSHOT.pom
[JENKINS] Archiving <https://builds.apache.org/job/Bigtop-trunk-testartifacts/ws/bigtop-tests/test-artifacts/solr/pom.xml>
to /home/hudson/hudson/jobs/Bigtop-trunk-testartifacts/modules/org.apache.bigtop.itest$solr-smoke/builds/2013-07-27_22-46-26/archive/org.apache.bigtop.itest/solr-smoke/0.7.0-SNAPSHOT/solr-smoke-0.7.0-SNAPSHOT.pom
[JENKINS] Archiving <https://builds.apache.org/job/Bigtop-trunk-testartifacts/ws/bigtop-tests/test-artifacts/pom.xml>
to /home/hudson/hudson/jobs/Bigtop-trunk-testartifacts/modules/org.apache.bigtop.itest$bigtop-smokes/builds/2013-07-27_22-46-26/archive/org.apache.bigtop.itest/bigtop-smokes/0.7.0-SNAPSHOT/bigtop-smokes-0.7.0-SNAPSHOT.pom
[JENKINS] Archiving <https://builds.apache.org/job/Bigtop-trunk-testartifacts/ws/bigtop-tests/test-artifacts/hadoop/pom.xml>
to /home/hudson/hudson/jobs/Bigtop-trunk-testartifacts/modules/org.apache.bigtop.itest$hadoop-smoke/builds/2013-07-27_22-46-26/archive/org.apache.bigtop.itest/hadoop-smoke/0.7.0-SNAPSHOT/hadoop-smoke-0.7.0-SNAPSHOT.pom
Waiting for Jenkins to finish collecting data
mavenExecutionResult exceptions not empty
message : Failed to execute goal on project bigtop-smokes: Could not resolve dependencies
for project org.apache.bigtop.itest:bigtop-smokes:pom:0.7.0-SNAPSHOT: Could not find artifact
junit:junit:jar:4.11za in central (http://repo.maven.apache.org/maven2)
cause : Could not resolve dependencies for project org.apache.bigtop.itest:bigtop-smokes:pom:0.7.0-SNAPSHOT:
Could not find artifact junit:junit:jar:4.11za in central (http://repo.maven.apache.org/maven2)
Stack trace : 
org.apache.maven.lifecycle.LifecycleExecutionException: Failed to execute goal on project
bigtop-smokes: Could not resolve dependencies for project org.apache.bigtop.itest:bigtop-smokes:pom:0.7.0-SNAPSHOT:
Could not find artifact junit:junit:jar:4.11za in central (http://repo.maven.apache.org/maven2)
	at org.apache.maven.lifecycle.internal.LifecycleDependencyResolver.getDependencies(LifecycleDependencyResolver.java:210)
	at org.apache.maven.lifecycle.internal.LifecycleDependencyResolver.resolveProjectDependencies(LifecycleDependencyResolver.java:117)
	at org.apache.maven.lifecycle.internal.MojoExecutor.ensureDependenciesAreResolved(MojoExecutor.java:258)
	at org.apache.maven.lifecycle.internal.MojoExecutor.execute(MojoExecutor.java:201)
	at org.apache.maven.lifecycle.internal.MojoExecutor.execute(MojoExecutor.java:153)
	at org.apache.maven.lifecycle.internal.MojoExecutor.execute(MojoExecutor.java:145)
	at org.apache.maven.lifecycle.internal.LifecycleModuleBuilder.buildProject(LifecycleModuleBuilder.java:84)
	at org.apache.maven.lifecycle.internal.LifecycleModuleBuilder.buildProject(LifecycleModuleBuilder.java:59)
	at org.apache.maven.lifecycle.internal.LifecycleStarter.singleThreadedBuild(LifecycleStarter.java:183)
	at org.apache.maven.lifecycle.internal.LifecycleStarter.execute(LifecycleStarter.java:161)
	at org.apache.maven.DefaultMaven.doExecute(DefaultMaven.java:320)
	at org.apache.maven.DefaultMaven.execute(DefaultMaven.java:156)
	at org.jvnet.hudson.maven3.launcher.Maven3Launcher.main(Maven3Launcher.java:117)
	at sun.reflect.NativeMethodAccessorImpl.invoke0(Native Method)
	at sun.reflect.NativeMethodAccessorImpl.invoke(NativeMethodAccessorImpl.java:39)
	at sun.reflect.DelegatingMethodAccessorImpl.invoke(DelegatingMethodAccessorImpl.java:25)
	at java.lang.reflect.Method.invoke(Method.java:597)
	at org.codehaus.plexus.classworlds.launcher.Launcher.launchStandard(Launcher.java:329)
	at org.codehaus.plexus.classworlds.launcher.Launcher.launch(Launcher.java:239)
	at org.jvnet.hudson.maven3.agent.Maven3Main.launch(Maven3Main.java:178)
	at sun.reflect.NativeMethodAccessorImpl.invoke0(Native Method)
	at sun.reflect.NativeMethodAccessorImpl.invoke(NativeMethodAccessorImpl.java:39)
	at sun.reflect.DelegatingMethodAccessorImpl.invoke(DelegatingMethodAccessorImpl.java:25)
	at java.lang.reflect.Method.invoke(Method.java:597)
	at hudson.maven.Maven3Builder.call(Maven3Builder.java:129)
	at hudson.maven.Maven3Builder.call(Maven3Builder.java:67)
	at hudson.remoting.UserRequest.perform(UserRequest.java:118)
	at hudson.remoting.UserRequest.perform(UserRequest.java:48)
	at hudson.remoting.Request$2.run(Request.java:326)
	at hudson.remoting.InterceptingExecutorService$1.call(InterceptingExecutorService.java:72)
	at java.util.concurrent.FutureTask$Sync.innerRun(FutureTask.java:303)
	at java.util.concurrent.FutureTask.run(FutureTask.java:138)
	at java.util.concurrent.ThreadPoolExecutor$Worker.runTask(ThreadPoolExecutor.java:895)
	at java.util.concurrent.ThreadPoolExecutor$Worker.run(ThreadPoolExecutor.java:918)
	at java.lang.Thread.run(Thread.java:662)
Caused by: org.apache.maven.project.DependencyResolutionException: Could not resolve dependencies
for project org.apache.bigtop.itest:bigtop-smokes:pom:0.7.0-SNAPSHOT: Could not find artifact
junit:junit:jar:4.11za in central (http://repo.maven.apache.org/maven2)
	at org.apache.maven.project.DefaultProjectDependenciesResolver.resolve(DefaultProjectDependenciesResolver.java:189)
	at org.apache.maven.lifecycle.internal.LifecycleDependencyResolver.getDependencies(LifecycleDependencyResolver.java:185)
	... 34 more
Caused by: org.sonatype.aether.resolution.DependencyResolutionException: Could not find artifact
junit:junit:jar:4.11za in central (http://repo.maven.apache.org/maven2)
	at org.sonatype.aether.impl.internal.DefaultRepositorySystem.resolveDependencies(DefaultRepositorySystem.java:375)
	at org.apache.maven.project.DefaultProjectDependenciesResolver.resolve(DefaultProjectDependenciesResolver.java:183)
	... 35 more
Caused by: org.sonatype.aether.resolution.ArtifactResolutionException: Could not find artifact
junit:junit:jar:4.11za in central (http://repo.maven.apache.org/maven2)
	at org.sonatype.aether.impl.internal.DefaultArtifactResolver.resolve(DefaultArtifactResolver.java:538)
	at org.sonatype.aether.impl.internal.DefaultArtifactResolver.resolveArtifacts(DefaultArtifactResolver.java:216)
	at org.sonatype.aether.impl.internal.DefaultRepositorySystem.resolveDependencies(DefaultRepositorySystem.java:358)
	... 36 more
Caused by: org.sonatype.aether.transfer.ArtifactNotFoundException: Could not find artifact
junit:junit:jar:4.11za in central (http://repo.maven.apache.org/maven2)
	at org.sonatype.aether.connector.wagon.WagonRepositoryConnector$4.wrap(WagonRepositoryConnector.java:947)
	at org.sonatype.aether.connector.wagon.WagonRepositoryConnector$4.wrap(WagonRepositoryConnector.java:941)
	at org.sonatype.aether.connector.wagon.WagonRepositoryConnector$GetTask.run(WagonRepositoryConnector.java:669)
	at org.sonatype.aether.util.concurrency.RunnableErrorForwarder$1.run(RunnableErrorForwarder.java:60)
	... 3 more
Sending e-mails to: ci@bigtop.apache.org
channel stopped

Mime
View raw message