bigtop-ci mailing list archives

Site index · List index
Message view « Date » · « Thread »
Top « Date » · « Thread »
From Apache Jenkins Server <jenk...@builds.apache.org>
Subject Build failed in Jenkins: Bigtop-trunk-test-execution #834
Date Sat, 27 Jul 2013 22:46:10 GMT
See <https://builds.apache.org/job/Bigtop-trunk-test-execution/834/changes>

Changes:

[cos] BIGTOP-938. Bigtop currently uses Junit 4.8.2, would be useful to upgrade to the latest
one that is Junit 4.11.

------------------------------------------
Started by an SCM change
Building remotely on ubuntu1 in workspace <https://builds.apache.org/job/Bigtop-trunk-test-execution/ws/>
Checkout:Bigtop-trunk-test-execution / <https://builds.apache.org/job/Bigtop-trunk-test-execution/ws/>
- hudson.remoting.Channel@2db957cb:ubuntu1
Using strategy: Default
Last Built Revision: Revision b2c03ce0353abff02af0a84553ae30f4e04aca88 (origin/master)
Cloning the remote Git repository
Cloning repository https://git-wip-us.apache.org/repos/asf/bigtop.git
git --version
git version 1.7.9.5
Fetching upstream changes from origin
Commencing build of Revision 7d9b7317af24af50143c9b636cbd3ac78bb1c202 (origin/master)
Checking out Revision 7d9b7317af24af50143c9b636cbd3ac78bb1c202 (origin/master)
[Bigtop-trunk-test-execution] $ /bin/bash -xe /tmp/hudson2237346681519894708.sh
+ export HADOOP_CONF_DIR=
+ HADOOP_CONF_DIR=
+ export HADOOP_HOME=
+ HADOOP_HOME=
+ /home/hudson/tools/maven/latest3/bin/mvn -f bigtop-tests/test-execution/pom.xml -DskipTests
-DskipITs deploy -DrepositoryId=apache.snapshots.https
[INFO] Scanning for projects...
[INFO] ------------------------------------------------------------------------
[INFO] Reactor Build Order:
[INFO] 
[INFO] stacks-validation-common
[INFO] smoke-tests-conf
[INFO] packagesmokes
[INFO] bigtop-smokes
[INFO]                                                                         
[INFO] ------------------------------------------------------------------------
[INFO] Building stacks-validation-common 0.7.0-SNAPSHOT
[INFO] ------------------------------------------------------------------------
[INFO] 
[INFO] --- maven-remote-resources-plugin:1.1:process (default) @ stacks-common ---
[INFO] Setting property: classpath.resource.loader.class => 'org.codehaus.plexus.velocity.ContextClassLoaderResourceLoader'.
[INFO] Setting property: velocimacro.messages.on => 'false'.
[INFO] Setting property: resource.loader => 'classpath'.
[INFO] Setting property: resource.manager.logwhenfound => 'false'.
Downloading: http://repo.maven.apache.org/maven2/junit/junit/4.11za/junit-4.11za.pom

[WARNING] Missing POM for junit:junit:jar:4.11za
Downloading: http://repo.maven.apache.org/maven2/junit/junit/4.11za/junit-4.11za.jar

[INFO] ------------------------------------------------------------------------
[INFO] Reactor Summary:
[INFO] 
[INFO] stacks-validation-common .......................... FAILURE [1.841s]
[INFO] smoke-tests-conf .................................. SKIPPED
[INFO] packagesmokes ..................................... SKIPPED
[INFO] bigtop-smokes ..................................... SKIPPED
[INFO] ------------------------------------------------------------------------
[INFO] BUILD FAILURE
[INFO] ------------------------------------------------------------------------
[INFO] Total time: 2.422s
[INFO] Finished at: Sat Jul 27 22:46:10 UTC 2013
[INFO] Final Memory: 7M/112M
[INFO] ------------------------------------------------------------------------
[ERROR] Failed to execute goal org.apache.maven.plugins:maven-remote-resources-plugin:1.1:process
(default) on project stacks-common: Failed to resolve dependencies for one or more projects
in the reactor. Reason: Missing:
[ERROR] ----------
[ERROR] 1) junit:junit:jar:4.11za
[ERROR] 
[ERROR] Try downloading the file manually from the project website.
[ERROR] 
[ERROR] Then, install it using the command:
[ERROR] mvn install:install-file -DgroupId=junit -DartifactId=junit -Dversion=4.11za -Dpackaging=jar
-Dfile=/path/to/file
[ERROR] 
[ERROR] Alternatively, if you host your own repository you can deploy the file there:
[ERROR] mvn deploy:deploy-file -DgroupId=junit -DartifactId=junit -Dversion=4.11za -Dpackaging=jar
-Dfile=/path/to/file -Durl=[url] -DrepositoryId=[id]
[ERROR] 
[ERROR] Path to dependency:
[ERROR] 1) org.apache.bigtop.itest:stacks-common:pom:0.7.0-SNAPSHOT
[ERROR] 2) org.codehaus.groovy.maven.runtime:gmaven-runtime-1.6:jar:1.0
[ERROR] 3) jline:jline:jar:0.9.94
[ERROR] 4) junit:junit:jar:4.11za
[ERROR] 
[ERROR] ----------
[ERROR] 1 required artifact is missing.
[ERROR] 
[ERROR] for artifact:
[ERROR] org.apache.bigtop.itest:stacks-common:pom:0.7.0-SNAPSHOT
[ERROR] 
[ERROR] from the specified remote repositories:
[ERROR] Nexus (http://repository.apache.org/snapshots, releases=false, snapshots=true),
[ERROR] central (http://repo.maven.apache.org/maven2, releases=true, snapshots=false)
[ERROR] -> [Help 1]
[ERROR] 
[ERROR] To see the full stack trace of the errors, re-run Maven with the -e switch.
[ERROR] Re-run Maven using the -X switch to enable full debug logging.
[ERROR] 
[ERROR] For more information about the errors and possible solutions, please read the following
articles:
[ERROR] [Help 1] http://cwiki.apache.org/confluence/display/MAVEN/MojoExecutionException
Build step 'Execute shell' marked build as failure

Mime
View raw message