bigtop-ci mailing list archives

Site index · List index
Message view « Date » · « Thread »
Top « Date » · « Thread »
From Apache Jenkins Server <jenk...@builds.apache.org>
Subject Build failed in Jenkins: Bigtop-trunk-testartifacts #1181
Date Tue, 11 Jun 2013 01:31:17 GMT
See <https://builds.apache.org/job/Bigtop-trunk-testartifacts/1181/changes>

Changes:

[rvs] Opening up Bigtop 0.7.0 development

------------------------------------------
Started by an SCM change
Started by an SCM change
Building remotely on ubuntu5 in workspace <https://builds.apache.org/job/Bigtop-trunk-testartifacts/ws/>
Checkout:Bigtop-trunk-testartifacts / <https://builds.apache.org/job/Bigtop-trunk-testartifacts/ws/>
- hudson.remoting.Channel@3a6bfffb:ubuntu5
Using strategy: Default
Last Built Revision: Revision ae10430ebe36b0f31011fc99799eaa0e5b19f236 (origin/master)
Fetching changes from 1 remote Git repository
Fetching upstream changes from https://git-wip-us.apache.org/repos/asf/bigtop.git
Commencing build of Revision 7242e2aede1fcabf8e2a25ea17e66f91663f682c (origin/master)
Checking out Revision 7242e2aede1fcabf8e2a25ea17e66f91663f682c (origin/master)
Parsing POMs
Modules changed, recalculating dependency graph
[test-artifacts] $ /home/hudson/tools/java/latest1.6/bin/java -cp /home/jenkins/jenkins-slave/maven3-agent.jar:/home/hudson/tools/maven/apache-maven-3.0.4/boot/plexus-classworlds-2.4.jar
org.jvnet.hudson.maven3.agent.Maven3Main /home/hudson/tools/maven/apache-maven-3.0.4 /home/jenkins/jenkins-slave/slave.jar
/home/jenkins/jenkins-slave/maven3-interceptor.jar 58509
<===[JENKINS REMOTING CAPACITY]===>channel started
   log4j:WARN No appenders could be found for logger (org.apache.commons.beanutils.converters.BooleanConverter).
log4j:WARN Please initialize the log4j system properly.
Executing Maven:  -B -f <https://builds.apache.org/job/Bigtop-trunk-testartifacts/ws/bigtop-tests/test-artifacts/pom.xml>
-Dmaven.repo.local=/home/jenkins/jenkins-slave/maven-repositories/0 -U clean deploy
[INFO] Scanning for projects...
Downloading: http://repository.codehaus.org/org/codehaus/groovy/groovy-eclipse-batch/maven-metadata.xml
Downloading: http://repo.maven.apache.org/maven2/org/codehaus/groovy/groovy-eclipse-batch/maven-metadata.xml
Downloading: http://nexus.codehaus.org/snapshots/org/codehaus/groovy/groovy-eclipse-batch/maven-metadata.xml
Downloaded: http://repo.maven.apache.org/maven2/org/codehaus/groovy/groovy-eclipse-batch/maven-metadata.xml
(2 KB at 7.1 KB/sec)
Downloaded: http://repository.codehaus.org/org/codehaus/groovy/groovy-eclipse-batch/maven-metadata.xml
(2 KB at 1.9 KB/sec)
[INFO] ------------------------------------------------------------------------
[INFO] Reactor Build Order:
[INFO] 
[INFO] bigtop-smokes
[INFO] hadoopsmoke
[INFO] packagesmoke
[INFO] ooziesmoke
[INFO] hivesmoke
[INFO] hbasesmoke
[INFO] flumesmoke
[INFO] sqoopsmokes
[INFO] mahoutsmoke
[INFO] giraphsmoke
[INFO] huesmoke
[INFO] solrsmoke
[INFO] crunchsmoke
[INFO] datafusmoke
[INFO] fatjar
[INFO] hcatalogsmoke
[INFO]                                                                         
[INFO] ------------------------------------------------------------------------
[INFO] Building bigtop-smokes 0.7.0-SNAPSHOT
[INFO] ------------------------------------------------------------------------
Downloading: http://repository.apache.org/snapshots/org/apache/bigtop/itest/itest-common/0.7.0-SNAPSHOT/maven-metadata.xml
Downloading: http://repository.apache.org/snapshots/org/apache/bigtop/itest/itest-common/0.7.0-SNAPSHOT/itest-common-0.7.0-SNAPSHOT.pom
[WARNING] The POM for org.apache.bigtop.itest:itest-common:jar:0.7.0-SNAPSHOT is missing,
no dependency information available
Downloading: http://repository.apache.org/snapshots/org/apache/bigtop/itest/itest-common/0.7.0-SNAPSHOT/itest-common-0.7.0-SNAPSHOT.jar
[INFO] ------------------------------------------------------------------------
[INFO] Reactor Summary:
[INFO] 
[INFO] bigtop-smokes ..................................... FAILURE [1.201s]
[INFO] hadoopsmoke ....................................... SKIPPED
[INFO] packagesmoke ...................................... SKIPPED
[INFO] ooziesmoke ........................................ SKIPPED
[INFO] hivesmoke ......................................... SKIPPED
[INFO] hbasesmoke ........................................ SKIPPED
[INFO] flumesmoke ........................................ SKIPPED
[INFO] sqoopsmokes ....................................... SKIPPED
[INFO] mahoutsmoke ....................................... SKIPPED
[INFO] giraphsmoke ....................................... SKIPPED
[INFO] huesmoke .......................................... SKIPPED
[INFO] solrsmoke ......................................... SKIPPED
[INFO] crunchsmoke ....................................... SKIPPED
[INFO] datafusmoke ....................................... SKIPPED
[INFO] fatjar ............................................ SKIPPED
[INFO] hcatalogsmoke ..................................... SKIPPED
[INFO] ------------------------------------------------------------------------
[INFO] BUILD FAILURE
[INFO] ------------------------------------------------------------------------
[INFO] Total time: 7.193s
[INFO] Finished at: Tue Jun 11 01:28:23 UTC 2013
[INFO] Final Memory: 7M/62M
[INFO] ------------------------------------------------------------------------
[JENKINS] Archiving <https://builds.apache.org/job/Bigtop-trunk-testartifacts/ws/bigtop-tests/test-artifacts/hcatalog/pom.xml>
to /home/hudson/hudson/jobs/Bigtop-trunk-testartifacts/modules/org.apache.bigtop.itest$hcatalog-smoke/builds/2013-06-11_01-28-03/archive/org.apache.bigtop.itest/hcatalog-smoke/0.7.0-SNAPSHOT/hcatalog-smoke-0.7.0-SNAPSHOT.pom
[JENKINS] Archiving <https://builds.apache.org/job/Bigtop-trunk-testartifacts/ws/bigtop-tests/test-artifacts/sqoop/pom.xml>
to /home/hudson/hudson/jobs/Bigtop-trunk-testartifacts/modules/org.apache.bigtop.itest$sqoop-smoke/builds/2013-06-11_01-28-03/archive/org.apache.bigtop.itest/sqoop-smoke/0.7.0-SNAPSHOT/sqoop-smoke-0.7.0-SNAPSHOT.pom
[JENKINS] Archiving <https://builds.apache.org/job/Bigtop-trunk-testartifacts/ws/bigtop-tests/test-artifacts/hue/pom.xml>
to /home/hudson/hudson/jobs/Bigtop-trunk-testartifacts/modules/org.apache.bigtop.itest$hue-smoke/builds/2013-06-11_01-28-03/archive/org.apache.bigtop.itest/hue-smoke/0.7.0-SNAPSHOT/hue-smoke-0.7.0-SNAPSHOT.pom
[JENKINS] Archiving <https://builds.apache.org/job/Bigtop-trunk-testartifacts/ws/bigtop-tests/test-artifacts/datafu/pom.xml>
to /home/hudson/hudson/jobs/Bigtop-trunk-testartifacts/modules/org.apache.bigtop.itest$datafu-smoke/builds/2013-06-11_01-28-03/archive/org.apache.bigtop.itest/datafu-smoke/0.7.0-SNAPSHOT/datafu-smoke-0.7.0-SNAPSHOT.pom
[JENKINS] Archiving <https://builds.apache.org/job/Bigtop-trunk-testartifacts/ws/bigtop-tests/test-artifacts/oozie/pom.xml>
to /home/hudson/hudson/jobs/Bigtop-trunk-testartifacts/modules/org.apache.bigtop.itest$oozie-smoke/builds/2013-06-11_01-28-03/archive/org.apache.bigtop.itest/oozie-smoke/0.7.0-SNAPSHOT/oozie-smoke-0.7.0-SNAPSHOT.pom
[JENKINS] Archiving <https://builds.apache.org/job/Bigtop-trunk-testartifacts/ws/bigtop-tests/test-artifacts/fatjar/pom.xml>
to /home/hudson/hudson/jobs/Bigtop-trunk-testartifacts/modules/org.apache.bigtop.itest$fat-smoke/builds/2013-06-11_01-28-03/archive/org.apache.bigtop.itest/fat-smoke/0.7.0-SNAPSHOT/fat-smoke-0.7.0-SNAPSHOT.pom
[JENKINS] Archiving <https://builds.apache.org/job/Bigtop-trunk-testartifacts/ws/bigtop-tests/test-artifacts/crunch/pom.xml>
to /home/hudson/hudson/jobs/Bigtop-trunk-testartifacts/modules/org.apache.bigtop.itest$crunch-smoke/builds/2013-06-11_01-28-03/archive/org.apache.bigtop.itest/crunch-smoke/0.7.0-SNAPSHOT/crunch-smoke-0.7.0-SNAPSHOT.pom
[JENKINS] Archiving <https://builds.apache.org/job/Bigtop-trunk-testartifacts/ws/bigtop-tests/test-artifacts/hbase/pom.xml>
to /home/hudson/hudson/jobs/Bigtop-trunk-testartifacts/modules/org.apache.bigtop.itest$hbase-smoke/builds/2013-06-11_01-28-03/archive/org.apache.bigtop.itest/hbase-smoke/0.7.0-SNAPSHOT/hbase-smoke-0.7.0-SNAPSHOT.pom
[JENKINS] Archiving <https://builds.apache.org/job/Bigtop-trunk-testartifacts/ws/bigtop-tests/test-artifacts/giraph/pom.xml>
to /home/hudson/hudson/jobs/Bigtop-trunk-testartifacts/modules/org.apache.bigtop.itest$giraph-smoke/builds/2013-06-11_01-28-03/archive/org.apache.bigtop.itest/giraph-smoke/0.7.0-SNAPSHOT/giraph-smoke-0.7.0-SNAPSHOT.pom
[JENKINS] Archiving <https://builds.apache.org/job/Bigtop-trunk-testartifacts/ws/bigtop-tests/test-artifacts/hive/pom.xml>
to /home/hudson/hudson/jobs/Bigtop-trunk-testartifacts/modules/org.apache.bigtop.itest$hive-smoke/builds/2013-06-11_01-28-03/archive/org.apache.bigtop.itest/hive-smoke/0.7.0-SNAPSHOT/hive-smoke-0.7.0-SNAPSHOT.pom
[JENKINS] Archiving <https://builds.apache.org/job/Bigtop-trunk-testartifacts/ws/bigtop-tests/test-artifacts/mahout/pom.xml>
to /home/hudson/hudson/jobs/Bigtop-trunk-testartifacts/modules/org.apache.bigtop.itest$mahout-smoke/builds/2013-06-11_01-28-03/archive/org.apache.bigtop.itest/mahout-smoke/0.7.0-SNAPSHOT/mahout-smoke-0.7.0-SNAPSHOT.pom
[JENKINS] Archiving <https://builds.apache.org/job/Bigtop-trunk-testartifacts/ws/bigtop-tests/test-artifacts/flume/pom.xml>
to /home/hudson/hudson/jobs/Bigtop-trunk-testartifacts/modules/org.apache.bigtop.itest$flume-smoke/builds/2013-06-11_01-28-03/archive/org.apache.bigtop.itest/flume-smoke/0.7.0-SNAPSHOT/flume-smoke-0.7.0-SNAPSHOT.pom
[JENKINS] Archiving <https://builds.apache.org/job/Bigtop-trunk-testartifacts/ws/bigtop-tests/test-artifacts/package/pom.xml>
to /home/hudson/hudson/jobs/Bigtop-trunk-testartifacts/modules/org.apache.bigtop.itest$package-smoke/builds/2013-06-11_01-28-03/archive/org.apache.bigtop.itest/package-smoke/0.7.0-SNAPSHOT/package-smoke-0.7.0-SNAPSHOT.pom
[JENKINS] Archiving <https://builds.apache.org/job/Bigtop-trunk-testartifacts/ws/bigtop-tests/test-artifacts/solr/pom.xml>
to /home/hudson/hudson/jobs/Bigtop-trunk-testartifacts/modules/org.apache.bigtop.itest$solr-smoke/builds/2013-06-11_01-28-03/archive/org.apache.bigtop.itest/solr-smoke/0.7.0-SNAPSHOT/solr-smoke-0.7.0-SNAPSHOT.pom
[JENKINS] Archiving <https://builds.apache.org/job/Bigtop-trunk-testartifacts/ws/bigtop-tests/test-artifacts/pom.xml>
to /home/hudson/hudson/jobs/Bigtop-trunk-testartifacts/modules/org.apache.bigtop.itest$bigtop-smokes/builds/2013-06-11_01-28-03/archive/org.apache.bigtop.itest/bigtop-smokes/0.7.0-SNAPSHOT/bigtop-smokes-0.7.0-SNAPSHOT.pom
[JENKINS] Archiving <https://builds.apache.org/job/Bigtop-trunk-testartifacts/ws/bigtop-tests/test-artifacts/hadoop/pom.xml>
to /home/hudson/hudson/jobs/Bigtop-trunk-testartifacts/modules/org.apache.bigtop.itest$hadoop-smoke/builds/2013-06-11_01-28-03/archive/org.apache.bigtop.itest/hadoop-smoke/0.7.0-SNAPSHOT/hadoop-smoke-0.7.0-SNAPSHOT.pom
Waiting for Jenkins to finish collecting data
mavenExecutionResult exceptions not empty
message : Failed to execute goal on project bigtop-smokes: Could not resolve dependencies
for project org.apache.bigtop.itest:bigtop-smokes:pom:0.7.0-SNAPSHOT: Could not find artifact
org.apache.bigtop.itest:itest-common:jar:0.7.0-SNAPSHOT in Nexus (http://repository.apache.org/snapshots)
cause : Could not resolve dependencies for project org.apache.bigtop.itest:bigtop-smokes:pom:0.7.0-SNAPSHOT:
Could not find artifact org.apache.bigtop.itest:itest-common:jar:0.7.0-SNAPSHOT in Nexus (http://repository.apache.org/snapshots)
Stack trace : 
org.apache.maven.lifecycle.LifecycleExecutionException: Failed to execute goal on project
bigtop-smokes: Could not resolve dependencies for project org.apache.bigtop.itest:bigtop-smokes:pom:0.7.0-SNAPSHOT:
Could not find artifact org.apache.bigtop.itest:itest-common:jar:0.7.0-SNAPSHOT in Nexus (http://repository.apache.org/snapshots)
	at org.apache.maven.lifecycle.internal.LifecycleDependencyResolver.getDependencies(LifecycleDependencyResolver.java:210)
	at org.apache.maven.lifecycle.internal.LifecycleDependencyResolver.resolveProjectDependencies(LifecycleDependencyResolver.java:117)
	at org.apache.maven.lifecycle.internal.MojoExecutor.ensureDependenciesAreResolved(MojoExecutor.java:258)
	at org.apache.maven.lifecycle.internal.MojoExecutor.execute(MojoExecutor.java:201)
	at org.apache.maven.lifecycle.internal.MojoExecutor.execute(MojoExecutor.java:153)
	at org.apache.maven.lifecycle.internal.MojoExecutor.execute(MojoExecutor.java:145)
	at org.apache.maven.lifecycle.internal.LifecycleModuleBuilder.buildProject(LifecycleModuleBuilder.java:84)
	at org.apache.maven.lifecycle.internal.LifecycleModuleBuilder.buildProject(LifecycleModuleBuilder.java:59)
	at org.apache.maven.lifecycle.internal.LifecycleStarter.singleThreadedBuild(LifecycleStarter.java:183)
	at org.apache.maven.lifecycle.internal.LifecycleStarter.execute(LifecycleStarter.java:161)
	at org.apache.maven.DefaultMaven.doExecute(DefaultMaven.java:320)
	at org.apache.maven.DefaultMaven.execute(DefaultMaven.java:156)
	at org.jvnet.hudson.maven3.launcher.Maven3Launcher.main(Maven3Launcher.java:79)
	at sun.reflect.NativeMethodAccessorImpl.invoke0(Native Method)
	at sun.reflect.NativeMethodAccessorImpl.invoke(NativeMethodAccessorImpl.java:39)
	at sun.reflect.DelegatingMethodAccessorImpl.invoke(DelegatingMethodAccessorImpl.java:25)
	at java.lang.reflect.Method.invoke(Method.java:597)
	at org.codehaus.plexus.classworlds.launcher.Launcher.launchStandard(Launcher.java:329)
	at org.codehaus.plexus.classworlds.launcher.Launcher.launch(Launcher.java:239)
	at org.jvnet.hudson.maven3.agent.Maven3Main.launch(Maven3Main.java:158)
	at hudson.maven.Maven3Builder.call(Maven3Builder.java:100)
	at hudson.maven.Maven3Builder.call(Maven3Builder.java:66)
	at hudson.remoting.UserRequest.perform(UserRequest.java:118)
	at hudson.remoting.UserRequest.perform(UserRequest.java:48)
	at hudson.remoting.Request$2.run(Request.java:326)
	at hudson.remoting.InterceptingExecutorService$1.call(InterceptingExecutorService.java:72)
	at java.util.concurrent.FutureTask$Sync.innerRun(FutureTask.java:303)
	at java.util.concurrent.FutureTask.run(FutureTask.java:138)
	at java.util.concurrent.ThreadPoolExecutor$Worker.runTask(ThreadPoolExecutor.java:895)
	at java.util.concurrent.ThreadPoolExecutor$Worker.run(ThreadPoolExecutor.java:918)
	at java.lang.Thread.run(Thread.java:662)
Caused by: org.apache.maven.project.DependencyResolutionException: Could not resolve dependencies
for project org.apache.bigtop.itest:bigtop-smokes:pom:0.7.0-SNAPSHOT: Could not find artifact
org.apache.bigtop.itest:itest-common:jar:0.7.0-SNAPSHOT in Nexus (http://repository.apache.org/snapshots)
	at org.apache.maven.project.DefaultProjectDependenciesResolver.resolve(DefaultProjectDependenciesResolver.java:189)
	at org.apache.maven.lifecycle.internal.LifecycleDependencyResolver.getDependencies(LifecycleDependencyResolver.java:185)
	... 30 more
Caused by: org.sonatype.aether.resolution.DependencyResolutionException: Could not find artifact
org.apache.bigtop.itest:itest-common:jar:0.7.0-SNAPSHOT in Nexus (http://repository.apache.org/snapshots)
	at org.sonatype.aether.impl.internal.DefaultRepositorySystem.resolveDependencies(DefaultRepositorySystem.java:375)
	at org.apache.maven.project.DefaultProjectDependenciesResolver.resolve(DefaultProjectDependenciesResolver.java:183)
	... 31 more
Caused by: org.sonatype.aether.resolution.ArtifactResolutionException: Could not find artifact
org.apache.bigtop.itest:itest-common:jar:0.7.0-SNAPSHOT in Nexus (http://repository.apache.org/snapshots)
	at org.sonatype.aether.impl.internal.DefaultArtifactResolver.resolve(DefaultArtifactResolver.java:538)
	at org.sonatype.aether.impl.internal.DefaultArtifactResolver.resolveArtifacts(DefaultArtifactResolver.java:216)
	at org.sonatype.aether.impl.internal.DefaultRepositorySystem.resolveDependencies(DefaultRepositorySystem.java:358)
	... 32 more
Caused by: org.sonatype.aether.transfer.ArtifactNotFoundException: Could not find artifact
org.apache.bigtop.itest:itest-common:jar:0.7.0-SNAPSHOT in Nexus (http://repository.apache.org/snapshots)
	at org.sonatype.aether.connector.wagon.WagonRepositoryConnector$4.wrap(WagonRepositoryConnector.java:947)
	at org.sonatype.aether.connector.wagon.WagonRepositoryConnector$4.wrap(WagonRepositoryConnector.java:941)
	at org.sonatype.aether.connector.wagon.WagonRepositoryConnector$GetTask.run(WagonRepositoryConnector.java:669)
	at org.sonatype.aether.util.concurrency.RunnableErrorForwarder$1.run(RunnableErrorForwarder.java:60)
	... 3 more
Sending e-mails to: ci@bigtop.apache.org
channel stopped

Mime
View raw message