beehive-dev mailing list archives

Site index · List index
Message view « Date » · « Thread »
Top « Date » · « Thread »
From Rich Feit <richf...@gmail.com>
Subject Re: Beehive Check-in Test (Linux) Failed
Date Fri, 02 Sep 2005 05:31:21 GMT
I'm seeing this error in the logs.  Is this happening because 
beehive.apache.org was down?

      [tch] BUILD SUCCESSFUL
      [tch] Total time: 1 minute 4 seconds

generate-html-log:

-generate-html-log:
     [echo] Generating Controls Test Report with GTLF
     [echo] beehive.home: /home/beehive/cc/svn/build/dist/apache-beehive-20050901205217
     [echo] gtlf.file: /home/beehive/cc/svn/build/test-dist/run/beehive-test-dist/build/testResults/controls/checkin/tch.xml
     [java] Buildfile: /home/beehive/cc/svn/build/test-dist/run/beehive-test-dist/controls/test/infra/gtlf/xsl/build.xml

     [java] test.report:
     [java] Creating /home/beehive/cc/svn/build/test-dist/run/beehive-test-dist/build/testResults/controls/checkin/tch.html
     [java] Deleting: /home/beehive/cc/svn/build/test-dist/run/beehive-test-dist/build/testResults/controls/checkin/tch.html
     [java] Processing /home/beehive/cc/svn/build/test-dist/run/beehive-test-dist/build/testResults/controls/checkin/tch.xml
to /home/beehive/cc/svn/build/test-dist/run/beehive-test-dist/build/testResults/controls/checkin/tch.html
     [java] Loading stylesheet /home/beehive/cc/svn/build/test-dist/run/beehive-test-dist/controls/test/infra/gtlf/xsl/TestReport.xsl
     [java] : Error! beehive.apache.org
     [java] : Error! com.sun.org.apache.xml.internal.utils.WrappedRuntimeException: beehive.apache.org
     [java] Failed to process /home/beehive/cc/svn/build/test-dist/run/beehive-test-dist/build/testResults/controls/checkin/tch.xml

     [java] BUILD FAILED
     [java] /home/beehive/cc/svn/build/test-dist/run/beehive-test-dist/controls/test/infra/gtlf/xsl/build.xml:322:
javax.xml.transform.TransformerException: javax.xml.transform.TransformerException: com.sun.org.apache.xml.internal.utils.WrappedRuntimeException:
beehive.apache.org

     [java] Total time: 14 seconds

BUILD FAILED
/home/beehive/cc/svn/build.xml:262: The following error occurred while executing this line:
/home/beehive/cc/svn/distribution.xml:634: The following error occurred while executing this
line:
/home/beehive/cc/svn/test/dist-test/build.xml:147: The following error occurred while executing
this line:
/home/beehive/cc/svn/build/test-dist/run/beehive-test-dist/build.xml:43: The following error
occurred while executing this line:
/home/beehive/cc/svn/build/test-dist/run/beehive-test-dist/build.xml:53: The following error
occurred while executing this line:
/home/beehive/cc/svn/build/test-dist/run/beehive-test-dist/controls/test/build.xml:99: The
following error occurred while executing this line:
/home/beehive/cc/svn/build/test-dist/run/beehive-test-dist/controls/test/build.xml:140: The
following error occurred while executing this line:
/home/beehive/cc/svn/build/test-dist/run/beehive-test-dist/controls/test/build.xml:161: The
following error occurred while executing this line:
/home/beehive/cc/svn/build/test-dist/run/beehive-test-dist/controls/test/build.xml:244: The
following error occurred while executing this line:
/home/beehive/cc/svn/build/test-dist/run/beehive-test-dist/controls/test/infra/tch/runtime/build.xml:54:
The following error occurred while executing this line:
/home/beehive/cc/svn/build/test-dist/run/beehive-test-dist/controls/test/infra/tch/runtime/build.xml:69:
Java returned: 1

Total time: 38 minutes 46 seconds



jzhuo@bea.com wrote:

>View results here -> http://beehive01.bea.com/cruisecontrol/buildresults?log=log20050901205217
>
>  
>

Mime
View raw message