beehive-dev mailing list archives

Site index · List index
Message view « Date » · « Thread »
Top « Date » · « Thread »
From "Eddie O'Neil" <ekon...@bea.com>
Subject Re: Beehive Check-in Test (Linux) Failed
Date Tue, 07 Jun 2005 17:01:43 GMT

   Yep -- looks like that was it.

   Controls test folks -- any thoughts as to how we can prevent this 
from happening next time?

Thanks!

Eddie

Eddie ONeil wrote:
>   The new website just went live, so we'll see if CC passes next time.
> 
> 
> 
> On 6/7/05, Eddie ONeil <ekoneil@gmail.com> wrote:
> 
>>  I'm guessing that this happened because of the website update
>>yesterday.  It appears that the controls test infrastructure is
>>relying on the presence of a DTD here:
>>
>>  http://incubator.apache.org/beehive/dtd/gtlf/gtlf-config-2.0.dtd
>>
>>and that this file no longer exists at this URL.  I've put it back and
>>am waiting for it to be picked up (can take 30 minutes or so).  After
>>the website update, the next checkin caused the tests to run and fail,
>>which explains the delay.
>>
>>Until this passes, it's all speculation, though.
>>
>>  :)
>>
>>  Can someone who tests controls comment as to why this DTD can't be
>>resolved without its presence at this URL and what we can do in the
>>future to prevent this?
>>
>>  Thanks!
>>
>>Eddie
>>
>>
>>On 6/7/05, Richard Feit <richard.feit@bea.com> wrote:
>>
>>>I've crawled through the logs, and all the build/test runs are successful.
>>>
>>>This appears to be an issue with TCH.  Both
>>>http://beehive01.bea.com/downloads/20050606221541/general/build.out and
>>>http://beehive01.bea.com/downloads/20050606221541/general/test.dist.out
>>>show the following error in the middle of the overall build, even though
>>>the ultimate result is BUILD SUCCESSFUL:
>>>
>>>
>>>>     [tch] BUILD SUCCESSFUL
>>>>     [tch] Total time: 10 seconds
>>>>
>>>>generate-html-log:
>>>>
>>>>-generate-html-log:
>>>>    [echo] gtlf.file: /home/beehive/cc/svn/controls/test/tch.xml
>>>>    [java] Buildfile: /home/beehive/cc/svn/controls/test/infra/gtlf/xsl/build.xml
>>>>
>>>>    [java] test.report:
>>>>    [java] Creating /home/beehive/cc/svn/controls/test/tch.html
>>>>    [java] Deleting: /home/beehive/cc/svn/controls/test/tch.html
>>>>    [java] Processing /home/beehive/cc/svn/controls/test/tch.xml to /home/beehive/cc/svn/controls/test/tch.html
>>>>    [java] Loading stylesheet /home/beehive/cc/svn/controls/test/infra/gtlf/xsl/TestReport.xsl
>>>>    [java] : Error! http://incubator.apache.org/beehive/dtd/gtlf/gtlf-config-2.0.dtd
>>>>    [java] : Error! com.sun.org.apache.xml.internal.utils.WrappedRuntimeException:
http://incubator.apache.org/beehive/dtd/gtlf/gtlf-config-2.0.dtd
>>>>    [java] Failed to process /home/beehive/cc/svn/controls/test/tch.xml
>>>>
>>>>    [java] BUILD FAILED
>>>>    [java] /home/beehive/cc/svn/controls/test/infra/gtlf/xsl/build.xml:306:
javax.xml.transform.TransformerException: javax.xml.transform.TransformerException: com.sun.org.apache.xml.internal.utils.WrappedRuntimeException:
http://incubator.apache.org/beehive/dtd/gtlf/gtlf-config-2.0.dtd
>>>>
>>>>    [java] Total time: 2 seconds
>>>>    [java] Java Result: 1
>>>>
>>>
>>>This happens after a *successful* TCH run.  Anyone know what's going on
>>>here?
>>>
>>>Rich
>>>
>>>
>>>
>>>jpembert@bea.com wrote:
>>>
>>>
>>>>View results here -> http://beehive01.bea.com/cruisecontrol/buildresults?log=log20050606221541
>>>>
>>>>
>>>>
>>>
> 


Mime
View raw message