beam-commits mailing list archives

Site index · List index
Message view « Date » · « Thread »
Top « Date » · « Thread »
From Apache Jenkins Server <jenk...@builds.apache.org>
Subject Build failed in Jenkins: beam_PostCommit_Python_VR_Flink #298
Date Wed, 10 Oct 2018 00:00:17 GMT
See <https://builds.apache.org/job/beam_PostCommit_Python_VR_Flink/298/display/redirect>

------------------------------------------
Started by timer
[EnvInject] - Loading node environment variables.
Building remotely on beam15 (beam) in workspace <https://builds.apache.org/job/beam_PostCommit_Python_VR_Flink/ws/>
 > git rev-parse --is-inside-work-tree # timeout=10
Fetching changes from the remote Git repository
 > git config remote.origin.url https://github.com/apache/beam.git # timeout=10
Fetching upstream changes from https://github.com/apache/beam.git
 > git --version # timeout=10
 > git fetch --tags --progress https://github.com/apache/beam.git +refs/heads/*:refs/remotes/origin/*
+refs/pull/${ghprbPullId}/*:refs/remotes/origin/pr/${ghprbPullId}/*
 > git rev-parse origin/master^{commit} # timeout=10
Checking out Revision 399c09fca45904ce8c55c022f9483db1b979c6a6 (origin/master)
 > git config core.sparsecheckout # timeout=10
 > git checkout -f 399c09fca45904ce8c55c022f9483db1b979c6a6
Commit message: "Merge pull request #6623 from apache/revert-6610-fixAssert"
 > git rev-list --no-walk 399c09fca45904ce8c55c022f9483db1b979c6a6 # timeout=10
Cleaning workspace
 > git rev-parse --verify HEAD # timeout=10
Resetting working tree
 > git reset --hard # timeout=10
 > git clean -fdx # timeout=10
[EnvInject] - Executing scripts and injecting environment variables after the SCM step.
[EnvInject] - Injecting as environment variables the properties content 
SPARK_LOCAL_IP=127.0.0.1

[EnvInject] - Variables injected successfully.
[Gradle] - Launching build.
[src] $ <https://builds.apache.org/job/beam_PostCommit_Python_VR_Flink/ws/src/gradlew>
--info --continue --max-workers=12 -Dorg.gradle.jvmargs=-Xms2g -Dorg.gradle.jvmargs=-Xmx4g
:beam-sdks-python:flinkValidatesRunner
Initialized native services in: /home/jenkins/.gradle/native
To honour the JVM settings for this build a new JVM will be forked. Please consider using
the daemon: https://docs.gradle.org/4.10.2/userguide/gradle_daemon.html.
Starting process 'Gradle build daemon'. Working directory: /home/jenkins/.gradle/daemon/4.10.2
Command: /usr/local/asfpackages/java/jdk1.8.0_172/bin/java -Xmx4g -Dfile.encoding=UTF-8 -Duser.country=US
-Duser.language=en -Duser.variant -cp /home/jenkins/.gradle/wrapper/dists/gradle-4.10.2-bin/cghg6c4gf4vkiutgsab8yrnwv/gradle-4.10.2/lib/gradle-launcher-4.10.2.jar
org.gradle.launcher.daemon.bootstrap.GradleDaemon 4.10.2
Successfully started process 'Gradle build daemon'
An attempt to start the daemon took 0.855 secs.
The client will now receive all logging from the daemon (pid: 20579). The daemon log file:
/home/jenkins/.gradle/daemon/4.10.2/daemon-20579.out.log
Closing daemon's stdin at end of input.
The daemon will no longer process any standard input.
Daemon will be stopped at the end of the build stopping after processing
Using 12 worker leases.
Starting Build
Parallel execution is an incubating feature.

> Configure project :buildSrc
Evaluating project ':buildSrc' using build file '<https://builds.apache.org/job/beam_PostCommit_Python_VR_Flink/ws/src/buildSrc/build.gradle'.>
file or directory '<https://builds.apache.org/job/beam_PostCommit_Python_VR_Flink/ws/src/buildSrc/src/test/groovy',>
not found
Selected primary task 'build' from project :
file or directory '<https://builds.apache.org/job/beam_PostCommit_Python_VR_Flink/ws/src/buildSrc/src/test/groovy',>
not found
:buildSrc:compileJava (Thread[Task worker for ':buildSrc',5,main]) started.
Using local directory build cache for build ':buildSrc' (location = /home/jenkins/.gradle/caches/build-cache-1,
removeUnusedEntriesAfter = 7 days).

> Task :buildSrc:compileJava NO-SOURCE
file or directory '<https://builds.apache.org/job/beam_PostCommit_Python_VR_Flink/ws/src/buildSrc/src/main/java',>
not found
Skipping task ':buildSrc:compileJava' as it has no source files and no previous output files.
:buildSrc:compileJava (Thread[Task worker for ':buildSrc',5,main]) completed. Took 0.079 secs.
:buildSrc:compileGroovy (Thread[Task worker for ':buildSrc',5,main]) started.

> Task :buildSrc:compileGroovy FROM-CACHE
Build cache key for task ':buildSrc:compileGroovy' is ffa895a1cf2b1718eb804dc82ad66ea4
Task ':buildSrc:compileGroovy' is not up-to-date because:
  No history is available.
Origin for task ':buildSrc:compileGroovy': {executionTime=2266, hostName=apache-beam-jenkins-slave-group-lbw6,
operatingSystem=Linux, buildInvocationId=67p7cwv2jbh23lrdpokdubwxee, creationTime=1538771065235,
type=org.gradle.api.tasks.compile.GroovyCompile_Decorated, userName=jenkins, gradleVersion=4.10.2,
rootPath=<https://builds.apache.org/job/beam_PostCommit_Python_VR_Flink/ws/src/buildSrc,>
path=:compileGroovy}
Unpacked output for task ':buildSrc:compileGroovy' from cache.
:buildSrc:compileGroovy (Thread[Task worker for ':buildSrc',5,main]) completed. Took 0.101
secs.
:buildSrc:processResources (Thread[Task worker for ':buildSrc',5,main]) started.

> Task :buildSrc:processResources NO-SOURCE
file or directory '<https://builds.apache.org/job/beam_PostCommit_Python_VR_Flink/ws/src/buildSrc/src/main/resources',>
not found
Skipping task ':buildSrc:processResources' as it has no source files and no previous output
files.
:buildSrc:processResources (Thread[Task worker for ':buildSrc',5,main]) completed. Took 0.001
secs.
:buildSrc:classes (Thread[Task worker for ':buildSrc',5,main]) started.

> Task :buildSrc:classes UP-TO-DATE
Skipping task ':buildSrc:classes' as it has no actions.
:buildSrc:classes (Thread[Task worker for ':buildSrc',5,main]) completed. Took 0.0 secs.
:buildSrc:jar (Thread[Task worker for ':buildSrc',5,main]) started.

> Task :buildSrc:jar
Build cache key for task ':buildSrc:jar' is 7445e5c45b21f8a690f2f547fcb49594
Caching disabled for task ':buildSrc:jar': Caching has not been enabled for the task
Task ':buildSrc:jar' is not up-to-date because:
  No history is available.
:buildSrc:jar (Thread[Task worker for ':buildSrc',5,main]) completed. Took 0.125 secs.
:buildSrc:assemble (Thread[Task worker for ':buildSrc',5,main]) started.

> Task :buildSrc:assemble
Skipping task ':buildSrc:assemble' as it has no actions.
:buildSrc:assemble (Thread[Task worker for ':buildSrc',5,main]) completed. Took 0.0 secs.
:buildSrc:spotlessGroovy (Thread[Task worker for ':buildSrc',5,main]) started.

> Task :buildSrc:spotlessGroovy
file or directory '<https://builds.apache.org/job/beam_PostCommit_Python_VR_Flink/ws/src/buildSrc/src/test/groovy',>
not found
file or directory '<https://builds.apache.org/job/beam_PostCommit_Python_VR_Flink/ws/src/buildSrc/src/test/groovy',>
not found
file or directory '<https://builds.apache.org/job/beam_PostCommit_Python_VR_Flink/ws/src/buildSrc/src/test/groovy',>
not found
Caching disabled for task ':buildSrc:spotlessGroovy': Caching has not been enabled for the
task
Task ':buildSrc:spotlessGroovy' is not up-to-date because:
  No history is available.
All input files are considered out-of-date for incremental task ':buildSrc:spotlessGroovy'.
file or directory '<https://builds.apache.org/job/beam_PostCommit_Python_VR_Flink/ws/src/buildSrc/src/test/groovy',>
not found
:buildSrc:spotlessGroovy (Thread[Task worker for ':buildSrc',5,main]) completed. Took 1.358
secs.
:buildSrc:spotlessGroovyCheck (Thread[Task worker for ':buildSrc',5,main]) started.

> Task :buildSrc:spotlessGroovyCheck
Skipping task ':buildSrc:spotlessGroovyCheck' as it has no actions.
:buildSrc:spotlessGroovyCheck (Thread[Task worker for ':buildSrc',5,main]) completed. Took
0.001 secs.
:buildSrc:spotlessGroovyGradle (Thread[Task worker for ':buildSrc',5,main]) started.

> Task :buildSrc:spotlessGroovyGradle
Caching disabled for task ':buildSrc:spotlessGroovyGradle': Caching has not been enabled for
the task
Task ':buildSrc:spotlessGroovyGradle' is not up-to-date because:
  No history is available.
All input files are considered out-of-date for incremental task ':buildSrc:spotlessGroovyGradle'.
:buildSrc:spotlessGroovyGradle (Thread[Task worker for ':buildSrc',5,main]) completed. Took
0.031 secs.
:buildSrc:spotlessGroovyGradleCheck (Thread[Task worker for ':buildSrc',5,main]) started.

> Task :buildSrc:spotlessGroovyGradleCheck
Skipping task ':buildSrc:spotlessGroovyGradleCheck' as it has no actions.
:buildSrc:spotlessGroovyGradleCheck (Thread[Task worker for ':buildSrc',5,main]) completed.
Took 0.0 secs.
:buildSrc:spotlessCheck (Thread[Task worker for ':buildSrc',5,main]) started.

> Task :buildSrc:spotlessCheck
Skipping task ':buildSrc:spotlessCheck' as it has no actions.
:buildSrc:spotlessCheck (Thread[Task worker for ':buildSrc',5,main]) completed. Took 0.0 secs.
:buildSrc:compileTestJava (Thread[Task worker for ':buildSrc',5,main]) started.

> Task :buildSrc:compileTestJava NO-SOURCE
file or directory '<https://builds.apache.org/job/beam_PostCommit_Python_VR_Flink/ws/src/buildSrc/src/test/java',>
not found
Skipping task ':buildSrc:compileTestJava' as it has no source files and no previous output
files.
:buildSrc:compileTestJava (Thread[Task worker for ':buildSrc',5,main]) completed. Took 0.002
secs.
:buildSrc:compileTestGroovy (Thread[Task worker for ':buildSrc',5,main]) started.

> Task :buildSrc:compileTestGroovy NO-SOURCE
file or directory '<https://builds.apache.org/job/beam_PostCommit_Python_VR_Flink/ws/src/buildSrc/src/test/groovy',>
not found
Skipping task ':buildSrc:compileTestGroovy' as it has no source files and no previous output
files.
:buildSrc:compileTestGroovy (Thread[Task worker for ':buildSrc',5,main]) completed. Took 0.001
secs.
:buildSrc:processTestResources (Thread[Task worker for ':buildSrc',5,main]) started.

> Task :buildSrc:processTestResources NO-SOURCE
file or directory '<https://builds.apache.org/job/beam_PostCommit_Python_VR_Flink/ws/src/buildSrc/src/test/resources',>
not found
Skipping task ':buildSrc:processTestResources' as it has no source files and no previous output
files.
:buildSrc:processTestResources (Thread[Task worker for ':buildSrc',5,main]) completed. Took
0.002 secs.
:buildSrc:testClasses (Thread[Task worker for ':buildSrc',5,main]) started.

> Task :buildSrc:testClasses UP-TO-DATE
Skipping task ':buildSrc:testClasses' as it has no actions.
:buildSrc:testClasses (Thread[Task worker for ':buildSrc',5,main]) completed. Took 0.0 secs.
:buildSrc:test (Thread[Task worker for ':buildSrc',5,main]) started.

> Task :buildSrc:test NO-SOURCE
Skipping task ':buildSrc:test' as it has no source files and no previous output files.
:buildSrc:test (Thread[Task worker for ':buildSrc',5,main]) completed. Took 0.002 secs.
:buildSrc:check (Thread[Task worker for ':buildSrc',5,main]) started.

> Task :buildSrc:check
Skipping task ':buildSrc:check' as it has no actions.
:buildSrc:check (Thread[Task worker for ':buildSrc',5,main]) completed. Took 0.0 secs.
:buildSrc:build (Thread[Task worker for ':buildSrc',5,main]) started.

> Task :buildSrc:build
Skipping task ':buildSrc:build' as it has no actions.
:buildSrc:build (Thread[Task worker for ':buildSrc',5,main]) completed. Took 0.0 secs.
Settings evaluated using settings file '<https://builds.apache.org/job/beam_PostCommit_Python_VR_Flink/ws/src/settings.gradle'.>
Using local directory build cache for the root build (location = /home/jenkins/.gradle/caches/build-cache-1,
removeUnusedEntriesAfter = 7 days).
Projects loaded. Root project using build file '<https://builds.apache.org/job/beam_PostCommit_Python_VR_Flink/ws/src/build.gradle'.>
Included projects: [root project 'beam', project ':beam-examples-java', project ':beam-model-fn-execution',
project ':beam-model-job-management', project ':beam-model-pipeline', project ':beam-runners-apex',
project ':beam-runners-core-construction-java', project ':beam-runners-core-java', project
':beam-runners-direct-java', project ':beam-runners-extensions-java-metrics', project ':beam-runners-flink_2.11',
project ':beam-runners-flink_2.11-job-server', project ':beam-runners-flink_2.11-job-server-container',
project ':beam-runners-gearpump', project ':beam-runners-google-cloud-dataflow-java', project
':beam-runners-google-cloud-dataflow-java-examples', project ':beam-runners-google-cloud-dataflow-java-examples-streaming',
project ':beam-runners-google-cloud-dataflow-java-fn-api-worker', project ':beam-runners-google-cloud-dataflow-java-legacy-worker',
project ':beam-runners-google-cloud-dataflow-java-windmill', project ':beam-runners-java-fn-execution',
project ':beam-runners-local-java-core', project ':beam-runners-reference-java', project ':beam-runners-reference-job-server',
project ':beam-runners-samza', project ':beam-runners-spark', project ':beam-sdks-go', project
':beam-sdks-go-container', project ':beam-sdks-go-examples', project ':beam-sdks-go-test',
project ':beam-sdks-java-build-tools', project ':beam-sdks-java-container', project ':beam-sdks-java-core',
project ':beam-sdks-java-extensions-google-cloud-platform-core', project ':beam-sdks-java-extensions-join-library',
project ':beam-sdks-java-extensions-json-jackson', project ':beam-sdks-java-extensions-protobuf',
project ':beam-sdks-java-extensions-sketching', project ':beam-sdks-java-extensions-sorter',
project ':beam-sdks-java-extensions-sql', project ':beam-sdks-java-extensions-sql-jdbc', project
':beam-sdks-java-extensions-sql-shell', project ':beam-sdks-java-fn-execution', project ':beam-sdks-java-harness',
project ':beam-sdks-java-io-amazon-web-services', project ':beam-sdks-java-io-amqp', project
':beam-sdks-java-io-cassandra', project ':beam-sdks-java-io-common', project ':beam-sdks-java-io-elasticsearch',
project ':beam-sdks-java-io-elasticsearch-tests-2', project ':beam-sdks-java-io-elasticsearch-tests-5',
project ':beam-sdks-java-io-elasticsearch-tests-6', project ':beam-sdks-java-io-elasticsearch-tests-common',
project ':beam-sdks-java-io-file-based-io-tests', project ':beam-sdks-java-io-google-cloud-platform',
project ':beam-sdks-java-io-hadoop-common', project ':beam-sdks-java-io-hadoop-file-system',
project ':beam-sdks-java-io-hadoop-input-format', project ':beam-sdks-java-io-hbase', project
':beam-sdks-java-io-hcatalog', project ':beam-sdks-java-io-jdbc', project ':beam-sdks-java-io-jms',
project ':beam-sdks-java-io-kafka', project ':beam-sdks-java-io-kinesis', project ':beam-sdks-java-io-kudu',
project ':beam-sdks-java-io-mongodb', project ':beam-sdks-java-io-mqtt', project ':beam-sdks-java-io-parquet',
project ':beam-sdks-java-io-redis', project ':beam-sdks-java-io-solr', project ':beam-sdks-java-io-synthetic',
project ':beam-sdks-java-io-tika', project ':beam-sdks-java-io-xml', project ':beam-sdks-java-javadoc',
project ':beam-sdks-java-load-tests', project ':beam-sdks-java-maven-archetypes-examples',
project ':beam-sdks-java-maven-archetypes-starter', project ':beam-sdks-java-nexmark', project
':beam-sdks-python', project ':beam-sdks-python-container', project ':beam-sdks-python-container-py3',
project ':beam-vendor-sdks-java-extensions-protobuf', project ':beam-website', project ':release']
Parallel execution with configuration on demand is an incubating feature.

> Configure project :
Evaluating root project 'beam' using build file '<https://builds.apache.org/job/beam_PostCommit_Python_VR_Flink/ws/src/build.gradle'.>

> Configure project :beam-sdks-python
Evaluating project ':beam-sdks-python' using build file '<https://builds.apache.org/job/beam_PostCommit_Python_VR_Flink/ws/src/sdks/python/build.gradle'.>

FAILURE: Build failed with an exception.

* What went wrong:
Task 'flinkValidatesRunner' not found in project ':beam-sdks-python'.

* Try:
Run gradlew tasks to get a list of available tasks. Run with --stacktrace option to get the
stack trace. Run with --debug option to get more log output. Run with --scan to get full insights.

* Get more help at https://help.gradle.org

Deprecated Gradle features were used in this build, making it incompatible with Gradle 5.0.
Use '--warning-mode all' to show the individual deprecation warnings.
See https://docs.gradle.org/4.10.2/userguide/command_line_interface.html#sec:command_line_warnings

BUILD FAILED in 8s

Publishing build scan...
https://gradle.com/s/zctnw3k7u7jyu

Build step 'Invoke Gradle script' changed build result to FAILURE
Build step 'Invoke Gradle script' marked build as failure

Mime
View raw message