beam-commits mailing list archives

Site index · List index
Message view « Date » · « Thread »
Top « Date » · « Thread »
From Apache Jenkins Server <jenk...@builds.apache.org>
Subject Build failed in Jenkins: beam_PostCommit_Java_ValidatesRunner_Samza_Gradle #884
Date Thu, 11 Oct 2018 19:17:11 GMT
See <https://builds.apache.org/job/beam_PostCommit_Java_ValidatesRunner_Samza_Gradle/884/display/redirect?page=changes>

Changes:

[valentyn] Skip tests that halt test suite execution on Python 3

[plovytsimon] [BEAM-5624] avro.schema parser for py3

------------------------------------------
[...truncated 76.77 KB...]
  No history is available.
Found 1 files
Processed src/test/avro/org/apache/beam/sdk/io/user.avsc
:beam-sdks-java-core:generateTestAvroJava (Thread[Task worker for ':' Thread 7,5,main]) completed.
Took 0.495 secs.
:beam-sdks-java-core:compileTestJava (Thread[Task worker for ':' Thread 7,5,main]) started.

> Task :beam-model-pipeline:shadowJar
*******************
GRADLE SHADOW STATS

Total Jars: 36 (includes project)
Total Time: 8.146s [8146ms]
Average Time/Jar: 0.2262777777778s [226.2777777778ms]
*******************
:beam-model-pipeline:shadowJar (Thread[Task worker for ':' Thread 5,5,main]) completed. Took
9.706 secs.
:beam-model-fn-execution:shadowJar (Thread[Task worker for ':' Thread 5,5,main]) started.
:beam-model-job-management:shadowJar (Thread[Task worker for ':' Thread 6,5,main]) started.

> Task :beam-sdks-java-extensions-google-cloud-platform-core:compileJava
Build cache key for task ':beam-sdks-java-extensions-google-cloud-platform-core:compileJava'
is 81ace31742e64326f4909d248cb94fb7
Task ':beam-sdks-java-extensions-google-cloud-platform-core:compileJava' is not up-to-date
because:
  No history is available.
Custom actions are attached to task ':beam-sdks-java-extensions-google-cloud-platform-core:compileJava'.
All input files are considered out-of-date for incremental task ':beam-sdks-java-extensions-google-cloud-platform-core:compileJava'.
Full recompilation is required because no incremental change information is available. This
is usually caused by clean builds or changing compiler arguments.
Compiling with error-prone compiler
<https://builds.apache.org/job/beam_PostCommit_Java_ValidatesRunner_Samza_Gradle/ws/src/sdks/java/extensions/google-cloud-platform-core/src/main/java/org/apache/beam/sdk/util/gcsfs/GcsPath.java>:542:
warning: [EqualsGetClass] Overriding Object#equals in a non-final class by using getClass
rather than instanceof breaks substitutability of subclasses.
  public boolean equals(Object o) {
                 ^
    (see https://errorprone.info/bugpattern/EqualsGetClass)
  Did you mean 'if (!(o instanceof GcsPath)) {'?
error: warnings found and -Werror specified
Note: <https://builds.apache.org/job/beam_PostCommit_Java_ValidatesRunner_Samza_Gradle/ws/src/sdks/java/extensions/google-cloud-platform-core/src/main/java/org/apache/beam/sdk/util/GcsUtil.java>
uses or overrides a deprecated API.
Note: Recompile with -Xlint:deprecation for details.
1 error
1 warning

> Task :beam-sdks-java-extensions-google-cloud-platform-core:compileJava FAILED
:beam-sdks-java-extensions-google-cloud-platform-core:compileJava (Thread[Task worker for
':' Thread 4,5,main]) completed. Took 6.937 secs.

> Task :beam-vendor-sdks-java-extensions-protobuf:compileJava
file or directory '<https://builds.apache.org/job/beam_PostCommit_Java_ValidatesRunner_Samza_Gradle/ws/src/vendor/sdks-java-extensions-protobuf/src/main/java',>
not found
Build cache key for task ':beam-vendor-sdks-java-extensions-protobuf:compileJava' is 59344db239e1db5d71b6a31a88504764
Task ':beam-vendor-sdks-java-extensions-protobuf:compileJava' is not up-to-date because:
  No history is available.
Custom actions are attached to task ':beam-vendor-sdks-java-extensions-protobuf:compileJava'.
All input files are considered out-of-date for incremental task ':beam-vendor-sdks-java-extensions-protobuf:compileJava'.
Full recompilation is required because no incremental change information is available. This
is usually caused by clean builds or changing compiler arguments.
file or directory '<https://builds.apache.org/job/beam_PostCommit_Java_ValidatesRunner_Samza_Gradle/ws/src/vendor/sdks-java-extensions-protobuf/src/main/java',>
not found
Compiling with error-prone compiler
Note: Some input files use or override a deprecated API.
Note: Recompile with -Xlint:deprecation for details.

> Task :beam-sdks-java-core:compileTestJava FAILED
Build cache key for task ':beam-sdks-java-core:compileTestJava' is 732edc4f70dd58061fedb9815b581828
Task ':beam-sdks-java-core:compileTestJava' is not up-to-date because:
  No history is available.
Custom actions are attached to task ':beam-sdks-java-core:compileTestJava'.
All input files are considered out-of-date for incremental task ':beam-sdks-java-core:compileTestJava'.
Full recompilation is required because no incremental change information is available. This
is usually caused by clean builds or changing compiler arguments.
Compiling with error-prone compiler
<https://builds.apache.org/job/beam_PostCommit_Java_ValidatesRunner_Samza_Gradle/ws/src/sdks/java/core/src/test/java/org/apache/beam/sdk/coders/AvroCoderTest.java>:105:
warning: [EqualsGetClass] Overriding Object#equals in a non-final class by using getClass
rather than instanceof breaks substitutability of subclasses.
    public boolean equals(Object o) {
                   ^
    (see https://errorprone.info/bugpattern/EqualsGetClass)
  Did you mean 'if (!(o instanceof Pojo)) {'?
<https://builds.apache.org/job/beam_PostCommit_Java_ValidatesRunner_Samza_Gradle/ws/src/sdks/java/core/src/test/java/org/apache/beam/sdk/coders/AvroCoderTest.java>:288:
warning: [UnnecessaryParentheses] Unnecessary use of grouping parentheses
    Schema schema = (new Schema.Parser()).parse(schemaString);
                    ^
    (see https://errorprone.info/bugpattern/UnnecessaryParentheses)
  Did you mean 'Schema schema = new Schema.Parser().parse(schemaString);'?
error: warnings found and -Werror specified
Note: Some input files use or override a deprecated API.
Note: Recompile with -Xlint:deprecation for details.
Note: <https://builds.apache.org/job/beam_PostCommit_Java_ValidatesRunner_Samza_Gradle/ws/src/sdks/java/core/src/test/java/org/apache/beam/sdk/coders/AvroCoderTest.java>
uses unchecked or unsafe operations.
Note: Recompile with -Xlint:unchecked for details.
1 error
2 warnings
:beam-sdks-java-core:compileTestJava (Thread[Task worker for ':' Thread 7,5,main]) completed.
Took 7.016 secs.
:beam-sdks-java-core:processTestResources (Thread[Task worker for ':' Thread 7,5,main]) started.

> Task :beam-sdks-java-core:processTestResources NO-SOURCE
file or directory '<https://builds.apache.org/job/beam_PostCommit_Java_ValidatesRunner_Samza_Gradle/ws/src/sdks/java/core/src/test/resources',>
not found
Skipping task ':beam-sdks-java-core:processTestResources' as it has no source files and no
previous output files.
:beam-sdks-java-core:processTestResources (Thread[Task worker for ':' Thread 7,5,main]) completed.
Took 0.004 secs.

> Task :beam-model-fn-execution:shadowJar
Build cache key for task ':beam-model-fn-execution:shadowJar' is 256a642bff4f01896bda4496cb4ffbaf
Caching disabled for task ':beam-model-fn-execution:shadowJar': Caching has not been enabled
for the task
Task ':beam-model-fn-execution:shadowJar' is not up-to-date because:
  No history is available.

> Task :beam-vendor-sdks-java-extensions-protobuf:compileJava
Created classpath snapshot for incremental compilation in 3.1 secs. 39 duplicate classes found
in classpath (see all with --debug).
Packing task ':beam-vendor-sdks-java-extensions-protobuf:compileJava'
:beam-vendor-sdks-java-extensions-protobuf:compileJava (Thread[Daemon worker,5,main]) completed.
Took 8.017 secs.
:beam-vendor-sdks-java-extensions-protobuf:classes (Thread[Daemon worker,5,main]) started.

> Task :beam-vendor-sdks-java-extensions-protobuf:classes
Skipping task ':beam-vendor-sdks-java-extensions-protobuf:classes' as it has no actions.
:beam-vendor-sdks-java-extensions-protobuf:classes (Thread[Daemon worker,5,main]) completed.
Took 0.0 secs.
:beam-vendor-sdks-java-extensions-protobuf:shadowJar (Thread[Daemon worker,5,main]) started.

> Task :beam-model-job-management:shadowJar
Build cache key for task ':beam-model-job-management:shadowJar' is 5f3bb24365da080eb1807460725dd8ab
Caching disabled for task ':beam-model-job-management:shadowJar': Caching has not been enabled
for the task
Task ':beam-model-job-management:shadowJar' is not up-to-date because:
  No history is available.

> Task :beam-vendor-sdks-java-extensions-protobuf:shadowJar
Build cache key for task ':beam-vendor-sdks-java-extensions-protobuf:shadowJar' is 71b11c17f6f73d70c632b225d78ac1db
Caching disabled for task ':beam-vendor-sdks-java-extensions-protobuf:shadowJar': Caching
has not been enabled for the task
Task ':beam-vendor-sdks-java-extensions-protobuf:shadowJar' is not up-to-date because:
  No history is available.
*******************
GRADLE SHADOW STATS

Total Jars: 2 (includes project)
Total Time: 1.599s [1599ms]
Average Time/Jar: 0.7995s [799.5ms]
*******************
:beam-vendor-sdks-java-extensions-protobuf:shadowJar (Thread[Daemon worker,5,main]) completed.
Took 1.652 secs.

> Task :beam-model-job-management:shadowJar
*******************
GRADLE SHADOW STATS

Total Jars: 37 (includes project)
Total Time: 17.35s [17350ms]
Average Time/Jar: 0.4689189189189s [468.9189189189ms]
*******************
:beam-model-job-management:shadowJar (Thread[Task worker for ':' Thread 6,5,main]) completed.
Took 19.101 secs.
:beam-runners-core-construction-java:compileJava (Thread[Task worker for ':' Thread 6,5,main])
started.

> Task :beam-model-fn-execution:shadowJar
*******************
GRADLE SHADOW STATS

Total Jars: 37 (includes project)
Total Time: 16.637s [16637ms]
Average Time/Jar: 0.4496486486486s [449.6486486486ms]
*******************
:beam-model-fn-execution:shadowJar (Thread[Task worker for ':' Thread 5,5,main]) completed.
Took 19.415 secs.
:beam-sdks-java-fn-execution:compileJava (Thread[Task worker for ':' Thread 5,5,main]) started.

> Task :beam-runners-core-construction-java:compileJava
Build cache key for task ':beam-runners-core-construction-java:compileJava' is 207c510a28bcc215f8d493fa8adcd07e
Task ':beam-runners-core-construction-java:compileJava' is not up-to-date because:
  No history is available.
Custom actions are attached to task ':beam-runners-core-construction-java:compileJava'.
All input files are considered out-of-date for incremental task ':beam-runners-core-construction-java:compileJava'.
Full recompilation is required because no incremental change information is available. This
is usually caused by clean builds or changing compiler arguments.
Compiling with error-prone compiler
<https://builds.apache.org/job/beam_PostCommit_Java_ValidatesRunner_Samza_Gradle/ws/src/runners/core-construction-java/src/main/java/org/apache/beam/runners/core/construction/ParDoTranslation.java>:573:
warning: [BadImport] Importing nested classes/static methods/static fields with commonly-used
names can make code harder to read, because it may not be clear from the context exactly which
type is being referred to. Qualifying the name with that of the containing class can make
the code clearer.
    Builder builder = SideInput.newBuilder();
    ^
    (see https://errorprone.info/bugpattern/BadImport)
  Did you mean 'SideInput.Builder builder = SideInput.newBuilder();'?
error: warnings found and -Werror specified
Note: Some input files use or override a deprecated API.
Note: Recompile with -Xlint:deprecation for details.
Note: Some input files use unchecked or unsafe operations.
Note: Recompile with -Xlint:unchecked for details.
1 error
1 warning

> Task :beam-runners-core-construction-java:compileJava FAILED
:beam-runners-core-construction-java:compileJava (Thread[Task worker for ':' Thread 6,5,main])
completed. Took 7.607 secs.

> Task :beam-sdks-java-fn-execution:compileJava
Build cache key for task ':beam-sdks-java-fn-execution:compileJava' is 2dadce20f3b47432bcb71da0dddf90c5
Task ':beam-sdks-java-fn-execution:compileJava' is not up-to-date because:
  No history is available.
Custom actions are attached to task ':beam-sdks-java-fn-execution:compileJava'.
All input files are considered out-of-date for incremental task ':beam-sdks-java-fn-execution:compileJava'.
Full recompilation is required because no incremental change information is available. This
is usually caused by clean builds or changing compiler arguments.
Compiling with error-prone compiler
Note: Some input files use unchecked or unsafe operations.
Note: Recompile with -Xlint:unchecked for details.
Created classpath snapshot for incremental compilation in 1.704 secs. 6714 duplicate classes
found in classpath (see all with --debug).
Packing task ':beam-sdks-java-fn-execution:compileJava'
:beam-sdks-java-fn-execution:compileJava (Thread[Task worker for ':' Thread 5,5,main]) completed.
Took 8.671 secs.
:beam-sdks-java-fn-execution:classes (Thread[Task worker for ':' Thread 5,5,main]) started.

> Task :beam-sdks-java-fn-execution:classes
Skipping task ':beam-sdks-java-fn-execution:classes' as it has no actions.
:beam-sdks-java-fn-execution:classes (Thread[Task worker for ':' Thread 5,5,main]) completed.
Took 0.0 secs.
:beam-sdks-java-fn-execution:shadowJar (Thread[Task worker for ':' Thread 5,5,main]) started.

> Task :beam-sdks-java-fn-execution:shadowJar
Build cache key for task ':beam-sdks-java-fn-execution:shadowJar' is f970399536dee770b93e264d6f8ac007
Caching disabled for task ':beam-sdks-java-fn-execution:shadowJar': Caching has not been enabled
for the task
Task ':beam-sdks-java-fn-execution:shadowJar' is not up-to-date because:
  No history is available.
*******************
GRADLE SHADOW STATS

Total Jars: 2 (includes project)
Total Time: 1.815s [1815ms]
Average Time/Jar: 0.9075s [907.5ms]
*******************
:beam-sdks-java-fn-execution:shadowJar (Thread[Task worker for ':' Thread 5,5,main]) completed.
Took 1.885 secs.

FAILURE: Build completed with 3 failures.

1: Task failed with an exception.
-----------
* What went wrong:
Execution failed for task ':beam-sdks-java-extensions-google-cloud-platform-core:compileJava'.
> Compilation failed with exit code 1; see the compiler error output for details.

* Try:
Run with --stacktrace option to get the stack trace. Run with --debug option to get more log
output. Run with --scan to get full insights.
==============================================================================

2: Task failed with an exception.
-----------
* What went wrong:
Execution failed for task ':beam-sdks-java-core:compileTestJava'.
> Compilation failed with exit code 1; see the compiler error output for details.

* Try:
Run with --stacktrace option to get the stack trace. Run with --debug option to get more log
output. Run with --scan to get full insights.
==============================================================================

3: Task failed with an exception.
-----------
* What went wrong:
Execution failed for task ':beam-runners-core-construction-java:compileJava'.
> Compilation failed with exit code 1; see the compiler error output for details.

* Try:
Run with --stacktrace option to get the stack trace. Run with --debug option to get more log
output. Run with --scan to get full insights.
==============================================================================

* Get more help at https://help.gradle.org

Deprecated Gradle features were used in this build, making it incompatible with Gradle 5.0.
Use '--warning-mode all' to show the individual deprecation warnings.
See https://docs.gradle.org/4.10.2/userguide/command_line_interface.html#sec:command_line_warnings

BUILD FAILED in 51s
31 actionable tasks: 27 executed, 4 from cache

Publishing build scan...
https://gradle.com/s/haqcq4lw7qcla

Build step 'Invoke Gradle script' changed build result to FAILURE
Build step 'Invoke Gradle script' marked build as failure

Mime
View raw message