beam-commits mailing list archives

Site index · List index
Message view « Date » · « Thread »
Top « Date » · « Thread »
From Apache Jenkins Server <jenk...@builds.apache.org>
Subject Build failed in Jenkins: beam_PostCommit_Java_Nexmark_Dataflow #441
Date Wed, 19 Sep 2018 20:23:03 GMT
See <https://builds.apache.org/job/beam_PostCommit_Java_Nexmark_Dataflow/441/display/redirect?page=changes>

Changes:

[schroederc] [BEAM-5382] Add fallback for non-binary MergeAccumulatorsFn

[schroederc] Add test for bare nonBinaryMergeFn

------------------------------------------
[...truncated 125.77 KB...]
  No history is available.
Custom actions are attached to task ':beam-sdks-java-fn-execution:compileJava'.
All input files are considered out-of-date for incremental task ':beam-sdks-java-fn-execution:compileJava'.
Compiling with error-prone compiler
Note: Some input files use unchecked or unsafe operations.
Note: Recompile with -Xlint:unchecked for details.
Packing task ':beam-sdks-java-fn-execution:compileJava'
:beam-sdks-java-fn-execution:compileJava (Thread[Daemon worker,5,main]) completed. Took 7.794
secs.
:beam-sdks-java-fn-execution:classes (Thread[Daemon worker,5,main]) started.

> Task :beam-sdks-java-fn-execution:classes
Skipping task ':beam-sdks-java-fn-execution:classes' as it has no actions.
:beam-sdks-java-fn-execution:classes (Thread[Daemon worker,5,main]) completed. Took 0.0 secs.
:beam-sdks-java-fn-execution:shadowJar (Thread[Daemon worker,5,main]) started.

> Task :beam-sdks-java-fn-execution:shadowJar
Build cache key for task ':beam-sdks-java-fn-execution:shadowJar' is f913dd5419253161c0e7a5758a37f5c9
Caching disabled for task ':beam-sdks-java-fn-execution:shadowJar': Caching has not been enabled
for the task
Task ':beam-sdks-java-fn-execution:shadowJar' is not up-to-date because:
  No history is available.
*******************
GRADLE SHADOW STATS

Total Jars: 2 (includes project)
Total Time: 2.296s [2296ms]
Average Time/Jar: 1.148s [1148.0ms]
*******************
:beam-sdks-java-fn-execution:shadowJar (Thread[Daemon worker,5,main]) completed. Took 2.398
secs.

> Task :beam-runners-core-construction-java:compileJava
Note: Some input files use or override a deprecated API.
Note: Recompile with -Xlint:deprecation for details.
Note: Some input files use unchecked or unsafe operations.
Note: Recompile with -Xlint:unchecked for details.
Packing task ':beam-runners-core-construction-java:compileJava'
:beam-runners-core-construction-java:compileJava (Thread[Task worker for ':' Thread 10,5,main])
completed. Took 11.239 secs.
:beam-runners-core-construction-java:classes (Thread[Task worker for ':' Thread 10,5,main])
started.

> Task :beam-runners-core-construction-java:classes
Skipping task ':beam-runners-core-construction-java:classes' as it has no actions.
:beam-runners-core-construction-java:classes (Thread[Task worker for ':' Thread 10,5,main])
completed. Took 0.0 secs.
:beam-runners-core-construction-java:shadowJar (Thread[Task worker for ':' Thread 2,5,main])
started.

> Task :beam-runners-core-construction-java:shadowJar
Build cache key for task ':beam-runners-core-construction-java:shadowJar' is 14968a9dedb0fd1299e6ea40cda66d77
Caching disabled for task ':beam-runners-core-construction-java:shadowJar': Caching has not
been enabled for the task
Task ':beam-runners-core-construction-java:shadowJar' is not up-to-date because:
  No history is available.
*******************
GRADLE SHADOW STATS

Total Jars: 2 (includes project)
Total Time: 2.207s [2207ms]
Average Time/Jar: 1.1035s [1103.5ms]
*******************
:beam-runners-core-construction-java:shadowJar (Thread[Task worker for ':' Thread 2,5,main])
completed. Took 2.539 secs.
:beam-runners-core-java:compileJava (Thread[Task worker for ':' Thread 2,5,main]) started.
:beam-runners-google-cloud-dataflow-java:compileJava (Thread[Task worker for ':' Thread 4,5,main])
started.

> Task :beam-runners-core-java:compileJava
Build cache key for task ':beam-runners-core-java:compileJava' is 17b495d12731ec23c3477dff34cad2e8
Task ':beam-runners-core-java:compileJava' is not up-to-date because:
  No history is available.
Custom actions are attached to task ':beam-runners-core-java:compileJava'.
All input files are considered out-of-date for incremental task ':beam-runners-core-java:compileJava'.
Compiling with error-prone compiler
Note: Some input files use or override a deprecated API.
Note: Recompile with -Xlint:deprecation for details.
Note: Some input files use unchecked or unsafe operations.
Note: Recompile with -Xlint:unchecked for details.
Packing task ':beam-runners-core-java:compileJava'
:beam-runners-core-java:compileJava (Thread[Task worker for ':' Thread 2,5,main]) completed.
Took 8.786 secs.
:beam-runners-core-java:classes (Thread[Task worker for ':' Thread 2,5,main]) started.

> Task :beam-runners-core-java:classes
Skipping task ':beam-runners-core-java:classes' as it has no actions.
:beam-runners-core-java:classes (Thread[Task worker for ':' Thread 2,5,main]) completed. Took
0.0 secs.
:beam-runners-core-java:shadowJar (Thread[Task worker for ':' Thread 2,5,main]) started.

> Task :beam-runners-google-cloud-dataflow-java:compileJava
Build cache key for task ':beam-runners-google-cloud-dataflow-java:compileJava' is 909382d34d3bbe0497366b496d0bc765
Task ':beam-runners-google-cloud-dataflow-java:compileJava' is not up-to-date because:
  No history is available.
Custom actions are attached to task ':beam-runners-google-cloud-dataflow-java:compileJava'.
All input files are considered out-of-date for incremental task ':beam-runners-google-cloud-dataflow-java:compileJava'.
Compiling with error-prone compiler
Note: Some input files use or override a deprecated API.
Note: Recompile with -Xlint:deprecation for details.
Note: Some input files use unchecked or unsafe operations.
Note: Recompile with -Xlint:unchecked for details.
Packing task ':beam-runners-google-cloud-dataflow-java:compileJava'
:beam-runners-google-cloud-dataflow-java:compileJava (Thread[Task worker for ':' Thread 4,5,main])
completed. Took 9.595 secs.
:beam-runners-google-cloud-dataflow-java:classes (Thread[Task worker for ':' Thread 4,5,main])
started.

> Task :beam-runners-google-cloud-dataflow-java:classes
Skipping task ':beam-runners-google-cloud-dataflow-java:classes' as it has no actions.
:beam-runners-google-cloud-dataflow-java:classes (Thread[Task worker for ':' Thread 4,5,main])
completed. Took 0.0 secs.
:beam-runners-google-cloud-dataflow-java:shadowJar (Thread[Task worker for ':' Thread 4,5,main])
started.

> Task :beam-runners-core-java:shadowJar
Build cache key for task ':beam-runners-core-java:shadowJar' is bd7b5836e89a237c0602c037383e4c19
Caching disabled for task ':beam-runners-core-java:shadowJar': Caching has not been enabled
for the task
Task ':beam-runners-core-java:shadowJar' is not up-to-date because:
  No history is available.
*******************
GRADLE SHADOW STATS

Total Jars: 2 (includes project)
Total Time: 2.202s [2202ms]
Average Time/Jar: 1.101s [1101.0ms]
*******************
:beam-runners-core-java:shadowJar (Thread[Task worker for ':' Thread 2,5,main]) completed.
Took 2.663 secs.
:beam-sdks-java-harness:compileJava (Thread[Task worker for ':' Thread 2,5,main]) started.

> Task :beam-runners-google-cloud-dataflow-java:shadowJar
Build cache key for task ':beam-runners-google-cloud-dataflow-java:shadowJar' is e2dbb3bcef4ba0c2da0b24ea9af20a97
Caching disabled for task ':beam-runners-google-cloud-dataflow-java:shadowJar': Caching has
not been enabled for the task
Task ':beam-runners-google-cloud-dataflow-java:shadowJar' is not up-to-date because:
  No history is available.
*******************
GRADLE SHADOW STATS

Total Jars: 2 (includes project)
Total Time: 2.155s [2155ms]
Average Time/Jar: 1.0775s [1077.5ms]
*******************
:beam-runners-google-cloud-dataflow-java:shadowJar (Thread[Task worker for ':' Thread 4,5,main])
completed. Took 2.457 secs.

> Task :beam-sdks-java-harness:compileJava
Build cache key for task ':beam-sdks-java-harness:compileJava' is 1b19ac29da72eabf5de37a3bc0b48e74
Task ':beam-sdks-java-harness:compileJava' is not up-to-date because:
  No history is available.
Custom actions are attached to task ':beam-sdks-java-harness:compileJava'.
All input files are considered out-of-date for incremental task ':beam-sdks-java-harness:compileJava'.
Compiling with error-prone compiler
Note: Some input files use or override a deprecated API.
Note: Recompile with -Xlint:deprecation for details.
Note: Some input files use unchecked or unsafe operations.
Note: Recompile with -Xlint:unchecked for details.
Packing task ':beam-sdks-java-harness:compileJava'
:beam-sdks-java-harness:compileJava (Thread[Task worker for ':' Thread 2,5,main]) completed.
Took 5.861 secs.
:beam-sdks-java-harness:classes (Thread[Task worker for ':' Thread 2,5,main]) started.

> Task :beam-sdks-java-harness:classes
Skipping task ':beam-sdks-java-harness:classes' as it has no actions.
:beam-sdks-java-harness:classes (Thread[Task worker for ':' Thread 2,5,main]) completed. Took
0.0 secs.
:beam-sdks-java-harness:jar (Thread[Task worker for ':',5,main]) started.

> Task :beam-sdks-java-harness:jar
Build cache key for task ':beam-sdks-java-harness:jar' is 4a07dfcfa99b023191a684da42957e62
Caching disabled for task ':beam-sdks-java-harness:jar': Caching has not been enabled for
the task
Task ':beam-sdks-java-harness:jar' is not up-to-date because:
  No history is available.
:beam-sdks-java-harness:jar (Thread[Task worker for ':',5,main]) completed. Took 0.033 secs.
:beam-sdks-java-harness:shadowJar (Thread[Task worker for ':',5,main]) started.

> Task :beam-sdks-java-harness:shadowJar
Build cache key for task ':beam-sdks-java-harness:shadowJar' is 4dd32c5c8836738907c3d70005600fcf
Caching disabled for task ':beam-sdks-java-harness:shadowJar': Caching has not been enabled
for the task
Task ':beam-sdks-java-harness:shadowJar' is not up-to-date because:
  No history is available.
*******************
GRADLE SHADOW STATS

Total Jars: 43 (includes project)
Total Time: 36.354s [36354ms]
Average Time/Jar: 0.8454418604651001s [845.4418604651ms]
*******************
:beam-sdks-java-harness:shadowJar (Thread[Task worker for ':',5,main]) completed. Took 36.912
secs.
:beam-runners-java-fn-execution:compileJava (Thread[Task worker for ':',5,main]) started.

> Task :beam-runners-java-fn-execution:compileJava
Build cache key for task ':beam-runners-java-fn-execution:compileJava' is a06879e56c8e628721dee1aa3a6ce5a9
Task ':beam-runners-java-fn-execution:compileJava' is not up-to-date because:
  No history is available.
Custom actions are attached to task ':beam-runners-java-fn-execution:compileJava'.
All input files are considered out-of-date for incremental task ':beam-runners-java-fn-execution:compileJava'.
Compiling with error-prone compiler
Note: <https://builds.apache.org/job/beam_PostCommit_Java_Nexmark_Dataflow/ws/src/runners/java-fn-execution/src/main/java/org/apache/beam/runners/fnexecution/ServerFactory.java>
uses or overrides a deprecated API.
Note: Recompile with -Xlint:deprecation for details.
Note: Some input files use unchecked or unsafe operations.
Note: Recompile with -Xlint:unchecked for details.
Packing task ':beam-runners-java-fn-execution:compileJava'
:beam-runners-java-fn-execution:compileJava (Thread[Task worker for ':',5,main]) completed.
Took 13.572 secs.
:beam-runners-java-fn-execution:classes (Thread[Task worker for ':',5,main]) started.

> Task :beam-runners-java-fn-execution:classes
Skipping task ':beam-runners-java-fn-execution:classes' as it has no actions.
:beam-runners-java-fn-execution:classes (Thread[Task worker for ':',5,main]) completed. Took
0.0 secs.
:beam-runners-java-fn-execution:shadowJar (Thread[Task worker for ':',5,main]) started.

> Task :beam-runners-java-fn-execution:shadowJar
Build cache key for task ':beam-runners-java-fn-execution:shadowJar' is 0b7e2c8de7c35537ece17b82fde5f300
Caching disabled for task ':beam-runners-java-fn-execution:shadowJar': Caching has not been
enabled for the task
Task ':beam-runners-java-fn-execution:shadowJar' is not up-to-date because:
  No history is available.
*******************
GRADLE SHADOW STATS

Total Jars: 2 (includes project)
Total Time: 2.294s [2294ms]
Average Time/Jar: 1.147s [1147.0ms]
*******************
:beam-runners-java-fn-execution:shadowJar (Thread[Task worker for ':',5,main]) completed.
Took 2.485 secs.
:beam-runners-direct-java:compileJava (Thread[Task worker for ':',5,main]) started.

> Task :beam-runners-direct-java:compileJava
Build cache key for task ':beam-runners-direct-java:compileJava' is 2f5eca7bc8de000ee0b18008c417c364
Task ':beam-runners-direct-java:compileJava' is not up-to-date because:
  No history is available.
Custom actions are attached to task ':beam-runners-direct-java:compileJava'.
All input files are considered out-of-date for incremental task ':beam-runners-direct-java:compileJava'.
Compiling with error-prone compiler
<https://builds.apache.org/job/beam_PostCommit_Java_Nexmark_Dataflow/ws/src/runners/direct-java/src/main/java/org/apache/beam/runners/direct/portable/ReferenceRunner.java>:268:
error: cannot find symbol
        return DockerJobBundleFactory.create(jobInfo);
                                     ^
  symbol:   method create(JobInfo)
  location: class DockerJobBundleFactory
Note: Some input files use or override a deprecated API.
Note: Recompile with -Xlint:deprecation for details.
Note: Some input files use unchecked or unsafe operations.
Note: Recompile with -Xlint:unchecked for details.
1 error

> Task :beam-runners-direct-java:compileJava FAILED
:beam-runners-direct-java:compileJava (Thread[Task worker for ':',5,main]) completed. Took
10.579 secs.

FAILURE: Build failed with an exception.

* What went wrong:
Execution failed for task ':beam-runners-direct-java:compileJava'.
> Compilation failed with exit code 1; see the compiler error output for details.

* Try:
Run with --stacktrace option to get the stack trace. Run with --debug option to get more log
output. Run with --scan to get full insights.

* Get more help at https://help.gradle.org

Deprecated Gradle features were used in this build, making it incompatible with Gradle 5.0.
See https://docs.gradle.org/4.8/userguide/command_line_interface.html#sec:command_line_warnings

BUILD FAILED in 2m 28s
59 actionable tasks: 55 executed, 4 from cache

Publishing build scan...
https://gradle.com/s/vbym4e55qhwm4

Build step 'Invoke Gradle script' changed build result to FAILURE
Build step 'Invoke Gradle script' marked build as failure

Mime
View raw message