beam-commits mailing list archives

Site index · List index
Message view « Date » · « Thread »
Top « Date » · « Thread »
From Apache Jenkins Server <jenk...@builds.apache.org>
Subject Build failed in Jenkins: beam_PreCommit_Java_Cron #181
Date Fri, 03 Aug 2018 12:21:39 GMT
See <https://builds.apache.org/job/beam_PreCommit_Java_Cron/181/display/redirect>

------------------------------------------
[...truncated 17.48 MB...]
    LogicalProject(auction=[$0], num=[$1])
      LogicalJoin(condition=[AND(=($2, $4), >=($1, $3))], joinType=[inner])
        LogicalProject(auction=[$0], num=[$2], starttime=[$1])
          LogicalAggregate(group=[{0, 1}], num=[COUNT()])
            LogicalProject(auction=[$0], $f1=[HOP($3, 5000, 10000)])
              BeamIOSourceRel(table=[[beam, Bid]])
        LogicalProject(maxnum=[$1], starttime=[$0])
          LogicalAggregate(group=[{0}], maxnum=[MAX($1)])
            LogicalProject(starttime=[$1], num=[$0])
              LogicalProject(num=[$2], starttime=[$1])
                LogicalAggregate(group=[{0, 1}], num=[COUNT()])
                  LogicalProject(auction=[$0], $f1=[HOP($3, 5000, 10000)])
                    BeamIOSourceRel(table=[[beam, Bid]])

    Aug 03, 2018 12:21:33 PM org.apache.beam.sdk.extensions.sql.impl.BeamQueryPlanner convertToBeamRel
    INFO: BEAMPlan>
    BeamCalcRel(expr#0..4=[{inputs}], proj#0..1=[{exprs}])
      BeamJoinRel(condition=[AND(=($2, $4), >=($1, $3))], joinType=[inner])
        BeamCalcRel(expr#0..2=[{inputs}], auction=[$t0], num=[$t2], starttime=[$t1])
          BeamAggregationRel(group=[{0, 1}], num=[COUNT()])
            BeamCalcRel(expr#0..4=[{inputs}], expr#5=[5000], expr#6=[10000], expr#7=[HOP($t3,
$t5, $t6)], auction=[$t0], $f1=[$t7])
              BeamIOSourceRel(table=[[beam, Bid]])
        BeamCalcRel(expr#0..1=[{inputs}], maxnum=[$t1], starttime=[$t0])
          BeamAggregationRel(group=[{1}], maxnum=[MAX($0)])
            BeamCalcRel(expr#0..2=[{inputs}], num=[$t2], starttime=[$t1])
              BeamAggregationRel(group=[{0, 1}], num=[COUNT()])
                BeamCalcRel(expr#0..4=[{inputs}], expr#5=[5000], expr#6=[10000], expr#7=[HOP($t3,
$t5, $t6)], auction=[$t0], $f1=[$t7])
                  BeamIOSourceRel(table=[[beam, Bid]])


org.apache.beam.sdk.nexmark.queries.sql.SqlQuery3Test > testJoinsPeopleWithAuctions STANDARD_ERROR
    Aug 03, 2018 12:21:33 PM org.apache.beam.sdk.extensions.sql.impl.BeamQueryPlanner convertToBeamRel
    INFO: SQL:
    SELECT `P`.`name`, `P`.`city`, `P`.`state`, `A`.`id`
    FROM `beam`.`Auction` AS `A`
    INNER JOIN `beam`.`Person` AS `P` ON `A`.`seller` = `P`.`id`
    WHERE `A`.`category` = 10 AND (`P`.`state` = 'OR' OR `P`.`state` = 'ID' OR `P`.`state`
= 'CA')
    Aug 03, 2018 12:21:33 PM org.apache.beam.sdk.extensions.sql.impl.BeamQueryPlanner convertToBeamRel
    INFO: SQLPlan>
    LogicalProject(name=[$11], city=[$14], state=[$15], id=[$0])
      LogicalFilter(condition=[AND(=($8, 10), OR(=($15, 'OR'), =($15, 'ID'), =($15, 'CA')))])
        LogicalJoin(condition=[=($7, $10)], joinType=[inner])
          BeamIOSourceRel(table=[[beam, Auction]])
          BeamIOSourceRel(table=[[beam, Person]])

    Aug 03, 2018 12:21:33 PM org.apache.beam.sdk.extensions.sql.impl.BeamQueryPlanner convertToBeamRel
    INFO: BEAMPlan>
    BeamCalcRel(expr#0..17=[{inputs}], name=[$t11], city=[$t14], state=[$t15], id=[$t0])
      BeamJoinRel(condition=[=($7, $10)], joinType=[inner])
        BeamCalcRel(expr#0..9=[{inputs}], expr#10=[10], expr#11=[=($t8, $t10)], proj#0..9=[{exprs}],
$condition=[$t11])
          BeamIOSourceRel(table=[[beam, Auction]])
        BeamCalcRel(expr#0..7=[{inputs}], expr#8=['OR'], expr#9=[=($t5, $t8)], expr#10=['ID'],
expr#11=[=($t5, $t10)], expr#12=['CA'], expr#13=[=($t5, $t12)], expr#14=[OR($t9, $t11, $t13)],
proj#0..7=[{exprs}], $condition=[$t14])
          BeamIOSourceRel(table=[[beam, Person]])


org.apache.beam.sdk.nexmark.queries.sql.SqlQuery7Test > testBids STANDARD_ERROR
    Aug 03, 2018 12:21:33 PM org.apache.beam.sdk.extensions.sql.impl.BeamQueryPlanner convertToBeamRel
    INFO: SQL:
    SELECT `B`.`auction`, `B`.`price`, `B`.`bidder`, `B`.`dateTime`, `B`.`extra`
    FROM (SELECT `B`.`auction`, `B`.`price`, `B`.`bidder`, `B`.`dateTime`, `B`.`extra`, TUMBLE_START(`B`.`dateTime`,
INTERVAL '10' SECOND) AS `starttime`
    FROM `beam`.`Bid` AS `B`
    GROUP BY `B`.`auction`, `B`.`price`, `B`.`bidder`, `B`.`dateTime`, `B`.`extra`, TUMBLE(`B`.`dateTime`,
INTERVAL '10' SECOND)) AS `B`
    INNER JOIN (SELECT MAX(`B1`.`price`) AS `maxprice`, TUMBLE_START(`B1`.`dateTime`, INTERVAL
'10' SECOND) AS `starttime`
    FROM `beam`.`Bid` AS `B1`
    GROUP BY TUMBLE(`B1`.`dateTime`, INTERVAL '10' SECOND)) AS `B1` ON `B`.`starttime` = `B1`.`starttime`
AND `B`.`price` = `B1`.`maxprice`
    Aug 03, 2018 12:21:33 PM org.apache.beam.sdk.extensions.sql.impl.BeamQueryPlanner convertToBeamRel
    INFO: SQLPlan>
    LogicalProject(auction=[$0], price=[$1], bidder=[$2], dateTime=[$3], extra=[$4])
      LogicalJoin(condition=[AND(=($5, $7), =($1, $6))], joinType=[inner])
        LogicalProject(auction=[$0], price=[$1], bidder=[$2], dateTime=[$3], extra=[$4], starttime=[$5])
          LogicalAggregate(group=[{0, 1, 2, 3, 4, 5}])
            LogicalProject(auction=[$0], price=[$2], bidder=[$1], dateTime=[$3], extra=[$4],
$f5=[TUMBLE($3, 10000)])
              BeamIOSourceRel(table=[[beam, Bid]])
        LogicalProject(maxprice=[$1], starttime=[$0])
          LogicalAggregate(group=[{0}], maxprice=[MAX($1)])
            LogicalProject($f0=[TUMBLE($3, 10000)], price=[$2])
              BeamIOSourceRel(table=[[beam, Bid]])

    Aug 03, 2018 12:21:33 PM org.apache.beam.sdk.extensions.sql.impl.BeamQueryPlanner convertToBeamRel
    INFO: BEAMPlan>
    BeamCalcRel(expr#0..7=[{inputs}], proj#0..4=[{exprs}])
      BeamJoinRel(condition=[AND(=($5, $7), =($1, $6))], joinType=[inner])
        BeamCalcRel(expr#0..5=[{inputs}], proj#0..5=[{exprs}])
          BeamAggregationRel(group=[{0, 1, 2, 3, 4, 5}])
            BeamCalcRel(expr#0..4=[{inputs}], expr#5=[10000], expr#6=[TUMBLE($t3, $t5)], auction=[$t0],
price=[$t2], bidder=[$t1], dateTime=[$t3], extra=[$t4], $f5=[$t6])
              BeamIOSourceRel(table=[[beam, Bid]])
        BeamCalcRel(expr#0..1=[{inputs}], maxprice=[$t1], starttime=[$t0])
          BeamAggregationRel(group=[{0}], maxprice=[MAX($1)])
            BeamCalcRel(expr#0..4=[{inputs}], expr#5=[10000], expr#6=[TUMBLE($t3, $t5)], $f0=[$t6],
price=[$t2])
              BeamIOSourceRel(table=[[beam, Bid]])


org.apache.beam.sdk.nexmark.queries.sql.SqlQuery2Test > testSkipsEverySecondElement STANDARD_ERROR
    Aug 03, 2018 12:21:33 PM org.apache.beam.sdk.extensions.sql.impl.BeamQueryPlanner convertToBeamRel
    INFO: SQL:
    SELECT `PCOLLECTION`.`auction`, `PCOLLECTION`.`price`
    FROM `beam`.`PCOLLECTION` AS `PCOLLECTION`
    WHERE MOD(`PCOLLECTION`.`auction`, 2) = 0
    Aug 03, 2018 12:21:33 PM org.apache.beam.sdk.extensions.sql.impl.BeamQueryPlanner convertToBeamRel
    INFO: SQLPlan>
    LogicalProject(auction=[$0], price=[$2])
      LogicalFilter(condition=[=(MOD($0, 2), 0)])
        BeamIOSourceRel(table=[[beam, PCOLLECTION]])

    Aug 03, 2018 12:21:33 PM org.apache.beam.sdk.extensions.sql.impl.BeamQueryPlanner convertToBeamRel
    INFO: BEAMPlan>
    BeamCalcRel(expr#0..4=[{inputs}], expr#5=[2], expr#6=[MOD($t0, $t5)], expr#7=[0], expr#8=[=($t6,
$t7)], auction=[$t0], price=[$t2], $condition=[$t8])
      BeamIOSourceRel(table=[[beam, PCOLLECTION]])


org.apache.beam.sdk.nexmark.queries.sql.SqlQuery2Test > testSkipsEveryThirdElement STANDARD_ERROR
    Aug 03, 2018 12:21:33 PM org.apache.beam.sdk.extensions.sql.impl.BeamQueryPlanner convertToBeamRel
    INFO: SQL:
    SELECT `PCOLLECTION`.`auction`, `PCOLLECTION`.`price`
    FROM `beam`.`PCOLLECTION` AS `PCOLLECTION`
    WHERE MOD(`PCOLLECTION`.`auction`, 3) = 0
    Aug 03, 2018 12:21:33 PM org.apache.beam.sdk.extensions.sql.impl.BeamQueryPlanner convertToBeamRel
    INFO: SQLPlan>
    LogicalProject(auction=[$0], price=[$2])
      LogicalFilter(condition=[=(MOD($0, 3), 0)])
        BeamIOSourceRel(table=[[beam, PCOLLECTION]])

    Aug 03, 2018 12:21:33 PM org.apache.beam.sdk.extensions.sql.impl.BeamQueryPlanner convertToBeamRel
    INFO: BEAMPlan>
    BeamCalcRel(expr#0..4=[{inputs}], expr#5=[3], expr#6=[MOD($t0, $t5)], expr#7=[0], expr#8=[=($t6,
$t7)], auction=[$t0], price=[$t2], $condition=[$t8])
      BeamIOSourceRel(table=[[beam, PCOLLECTION]])


org.apache.beam.sdk.nexmark.queries.sql.SqlQuery1Test > testConvertsPriceToEur STANDARD_ERROR
    Aug 03, 2018 12:21:33 PM org.apache.beam.sdk.extensions.sql.impl.BeamQueryPlanner convertToBeamRel
    INFO: SQL:
    SELECT `PCOLLECTION`.`auction`, `PCOLLECTION`.`bidder`, `DolToEur`(`PCOLLECTION`.`price`)
AS `price`, `PCOLLECTION`.`dateTime`, `PCOLLECTION`.`extra`
    FROM `beam`.`PCOLLECTION` AS `PCOLLECTION`
    Aug 03, 2018 12:21:33 PM org.apache.beam.sdk.extensions.sql.impl.BeamQueryPlanner convertToBeamRel
    INFO: SQLPlan>
    LogicalProject(auction=[$0], bidder=[$1], price=[DolToEur($2)], dateTime=[$3], extra=[$4])
      BeamIOSourceRel(table=[[beam, PCOLLECTION]])

    Aug 03, 2018 12:21:33 PM org.apache.beam.sdk.extensions.sql.impl.BeamQueryPlanner convertToBeamRel
    INFO: BEAMPlan>
    BeamCalcRel(expr#0..4=[{inputs}], expr#5=[DolToEur($t2)], proj#0..1=[{exprs}], price=[$t5],
dateTime=[$t3], extra=[$t4])
      BeamIOSourceRel(table=[[beam, PCOLLECTION]])


Gradle Test Executor 132 finished executing tests.

> Task :beam-sdks-java-nexmark:test
Finished generating test XML results (0.003 secs) into: <https://builds.apache.org/job/beam_PreCommit_Java_Cron/ws/src/sdks/java/nexmark/build/test-results/test>
Generating HTML test report...
Finished generating test html results (0.008 secs) into: <https://builds.apache.org/job/beam_PreCommit_Java_Cron/ws/src/sdks/java/nexmark/build/reports/tests/test>
Packing task ':beam-sdks-java-nexmark:test'
:beam-sdks-java-nexmark:test (Thread[Task worker for ':' Thread 3,5,main]) completed. Took
9 mins 43.403 secs.
:beam-sdks-java-nexmark:shadowJar (Thread[Task worker for ':' Thread 3,5,main]) started.

> Task :beam-sdks-java-nexmark:shadowJar
Build cache key for task ':beam-sdks-java-nexmark:shadowJar' is 374f5901166fdf69266dbb9a206b2ec2
Caching disabled for task ':beam-sdks-java-nexmark:shadowJar': Caching has not been enabled
for the task
Task ':beam-sdks-java-nexmark:shadowJar' is not up-to-date because:
  No history is available.
*******************
GRADLE SHADOW STATS

Total Jars: 2 (includes project)
Total Time: 2.391s [2391ms]
Average Time/Jar: 1.1955s [1195.5ms]
*******************
:beam-sdks-java-nexmark:shadowJar (Thread[Task worker for ':' Thread 3,5,main]) completed.
Took 2.971 secs.
:beam-sdks-java-nexmark:validateShadedJarDoesntLeakNonOrgApacheBeamClasses (Thread[Task worker
for ':' Thread 3,5,main]) started.

> Task :beam-sdks-java-nexmark:validateShadedJarDoesntLeakNonOrgApacheBeamClasses
Caching disabled for task ':beam-sdks-java-nexmark:validateShadedJarDoesntLeakNonOrgApacheBeamClasses':
Caching has not been enabled for the task
Task ':beam-sdks-java-nexmark:validateShadedJarDoesntLeakNonOrgApacheBeamClasses' is not up-to-date
because:
  Task has not declared any outputs despite executing actions.
:beam-sdks-java-nexmark:validateShadedJarDoesntLeakNonOrgApacheBeamClasses (Thread[Task worker
for ':' Thread 3,5,main]) completed. Took 0.042 secs.
:beam-sdks-java-nexmark:check (Thread[Task worker for ':' Thread 3,5,main]) started.

> Task :beam-sdks-java-nexmark:check
Skipping task ':beam-sdks-java-nexmark:check' as it has no actions.
:beam-sdks-java-nexmark:check (Thread[Task worker for ':' Thread 3,5,main]) completed. Took
0.0 secs.
:beam-sdks-java-nexmark:build (Thread[Daemon worker,5,main]) started.

> Task :beam-sdks-java-nexmark:build
Skipping task ':beam-sdks-java-nexmark:build' as it has no actions.
:beam-sdks-java-nexmark:build (Thread[Daemon worker,5,main]) completed. Took 0.0 secs.
:beam-sdks-java-nexmark:buildDependents (Thread[Daemon worker,5,main]) started.

> Task :beam-sdks-java-nexmark:buildDependents
Caching disabled for task ':beam-sdks-java-nexmark:buildDependents': Caching has not been
enabled for the task
Task ':beam-sdks-java-nexmark:buildDependents' is not up-to-date because:
  Task has not declared any outputs despite executing actions.
:beam-sdks-java-nexmark:buildDependents (Thread[Daemon worker,5,main]) completed. Took 0.0
secs.
:beam-sdks-java-extensions-sql:buildDependents (Thread[Daemon worker,5,main]) started.
:beam-sdks-java-io-google-cloud-platform:buildDependents (Thread[Task worker for ':' Thread
9,5,main]) started.

> Task :beam-sdks-java-extensions-sql:buildDependents
Caching disabled for task ':beam-sdks-java-extensions-sql:buildDependents': Caching has not
been enabled for the task
Task ':beam-sdks-java-extensions-sql:buildDependents' is not up-to-date because:
  Task has not declared any outputs despite executing actions.
:beam-sdks-java-extensions-sql:buildDependents (Thread[Daemon worker,5,main]) completed. Took
0.0 secs.

> Task :beam-sdks-java-io-google-cloud-platform:buildDependents
Caching disabled for task ':beam-sdks-java-io-google-cloud-platform:buildDependents': Caching
has not been enabled for the task
Task ':beam-sdks-java-io-google-cloud-platform:buildDependents' is not up-to-date because:
  Task has not declared any outputs despite executing actions.
:beam-sdks-java-extensions-join-library:buildDependents (Thread[Task worker for ':' Thread
7,5,main]) started.
:beam-sdks-java-io-google-cloud-platform:buildDependents (Thread[Task worker for ':' Thread
9,5,main]) completed. Took 0.0 secs.
:beam-sdks-java-io-kafka:buildDependents (Thread[Task worker for ':' Thread 5,5,main]) started.

> Task :beam-sdks-java-extensions-join-library:buildDependents
Caching disabled for task ':beam-sdks-java-extensions-join-library:buildDependents': Caching
has not been enabled for the task
Task ':beam-sdks-java-extensions-join-library:buildDependents' is not up-to-date because:
  Task has not declared any outputs despite executing actions.
:beam-sdks-java-extensions-join-library:buildDependents (Thread[Task worker for ':' Thread
7,5,main]) completed. Took 0.0 secs.
:beam-sdks-java-extensions-protobuf:buildDependents (Thread[Task worker for ':' Thread 9,5,main])
started.

> Task :beam-sdks-java-io-kafka:buildDependents
Caching disabled for task ':beam-sdks-java-io-kafka:buildDependents': Caching has not been
enabled for the task
Task ':beam-sdks-java-io-kafka:buildDependents' is not up-to-date because:
  Task has not declared any outputs despite executing actions.
:beam-sdks-java-io-kafka:buildDependents (Thread[Task worker for ':' Thread 5,5,main]) completed.
Took 0.001 secs.

> Task :beam-sdks-java-extensions-protobuf:buildDependents
Caching disabled for task ':beam-sdks-java-extensions-protobuf:buildDependents': Caching has
not been enabled for the task
Task ':beam-sdks-java-extensions-protobuf:buildDependents' is not up-to-date because:
  Task has not declared any outputs despite executing actions.
:beam-sdks-java-extensions-protobuf:buildDependents (Thread[Task worker for ':' Thread 9,5,main])
completed. Took 0.0 secs.

FAILURE: Build failed with an exception.

* What went wrong:
Execution failed for task ':beam-sdks-java-io-elasticsearch-tests-2:test'.
> There were failing tests. See the report at: file://<https://builds.apache.org/job/beam_PreCommit_Java_Cron/ws/src/sdks/java/io/elasticsearch-tests/elasticsearch-tests-2/build/reports/tests/test/index.html>

* Try:
Run with --stacktrace option to get the stack trace. Run with --debug option to get more log
output. Run with --scan to get full insights.

* Get more help at https://help.gradle.org

Deprecated Gradle features were used in this build, making it incompatible with Gradle 5.0.
See https://docs.gradle.org/4.8/userguide/command_line_interface.html#sec:command_line_warnings

BUILD FAILED in 21m 7s
748 actionable tasks: 743 executed, 5 from cache

Publishing build scan...
https://gradle.com/s/jfij5taljduz6

Build step 'Invoke Gradle script' changed build result to FAILURE
Build step 'Invoke Gradle script' marked build as failure

Mime
View raw message